Build #39

Build: #39 was successful

Job: Debian Snapshot was successful

Job result summary

Completed
Duration
14 minutes
Revision
40019a6b29106b2256d193ea26cdfec4275643cc 40019a6b29106b2256d193ea26cdfec4275643cc

Error summary

The build generated some errors. See the full build log for more details.

Can't stat /home/bamboo/.m2/repository-POWEREDBY-PBO2015-DEB: No such file or directory
at /usr/local/bin/nightly.pl line 268.
Use of uninitialized value $shortversion in hash element at /home/bamboo/ci/bamboo/xml-data/build-dir/POWEREDBY-PBO2015-DEB/build/bin/functions.pl line 375.
Use of uninitialized value $shortversion in hash element at /home/bamboo/ci/bamboo/xml-data/build-dir/POWEREDBY-PBO2015-DEB/build/bin/functions.pl line 377.
Use of uninitialized value $shortversion in hash element at /home/bamboo/ci/bamboo/xml-data/build-dir/POWEREDBY-PBO2015-DEB/build/bin/functions.pl line 375.
Use of uninitialized value $shortversion in hash element at /home/bamboo/ci/bamboo/xml-data/build-dir/POWEREDBY-PBO2015-DEB/build/bin/functions.pl line 375.
Use of uninitialized value $shortversion in hash element at /home/bamboo/ci/bamboo/xml-data/build-dir/POWEREDBY-PBO2015-DEB/build/bin/functions.pl line 377.
Argument "" isn't numeric in numeric lt (<) at /home/bamboo/ci/bamboo/xml-data/build-dir/POWEREDBY-PBO2015-DEB/build/bin/functions.pl line 385.
Use of uninitialized value $shortversion in hash element at /home/bamboo/ci/bamboo/xml-data/build-dir/POWEREDBY-PBO2015-DEB/build/bin/functions.pl line 375.
Use of uninitialized value $shortversion in hash element at /home/bamboo/ci/bamboo/xml-data/build-dir/POWEREDBY-PBO2015-DEB/build/bin/functions.pl line 377.
Use of uninitialized value $shortversion in hash element at /home/bamboo/ci/bamboo/xml-data/build-dir/POWEREDBY-PBO2015-DEB/build/bin/functions.pl line 375.
Use of uninitialized value $shortversion in hash element at /home/bamboo/ci/bamboo/xml-data/build-dir/POWEREDBY-PBO2015-DEB/build/bin/functions.pl line 375.
Use of uninitialized value $shortversion in hash element at /home/bamboo/ci/bamboo/xml-data/build-dir/POWEREDBY-PBO2015-DEB/build/bin/functions.pl line 377.
Argument "" isn't numeric in numeric lt (<) at /home/bamboo/ci/bamboo/xml-data/build-dir/POWEREDBY-PBO2015-DEB/build/bin/functions.pl line 385.
Use of uninitialized value $shortversion in hash element at /home/bamboo/ci/bamboo/xml-data/build-dir/POWEREDBY-PBO2015-DEB/build/bin/functions.pl line 375.
Use of uninitialized value $shortversion in hash element at /home/bamboo/ci/bamboo/xml-data/build-dir/POWEREDBY-PBO2015-DEB/build/bin/functions.pl line 377.
Use of uninitialized value $shortversion in hash element at /home/bamboo/ci/bamboo/xml-data/build-dir/POWEREDBY-PBO2015-DEB/build/bin/functions.pl line 375.
Use of uninitialized value $shortversion in hash element at /home/bamboo/ci/bamboo/xml-data/build-dir/POWEREDBY-PBO2015-DEB/build/bin/functions.pl line 375.
Use of uninitialized value $shortversion in hash element at /home/bamboo/ci/bamboo/xml-data/build-dir/POWEREDBY-PBO2015-DEB/build/bin/functions.pl line 377.
Argument "" isn't numeric in numeric lt (<) at /home/bamboo/ci/bamboo/xml-data/build-dir/POWEREDBY-PBO2015-DEB/build/bin/functions.pl line 385.
Use of uninitialized value $shortversion in hash element at /home/bamboo/ci/bamboo/xml-data/build-dir/POWEREDBY-PBO2015-DEB/build/bin/functions.pl line 375.
Use of uninitialized value $shortversion in hash element at /home/bamboo/ci/bamboo/xml-data/build-dir/POWEREDBY-PBO2015-DEB/build/bin/functions.pl line 377.
Use of uninitialized value $shortversion in hash element at /home/bamboo/ci/bamboo/xml-data/build-dir/POWEREDBY-PBO2015-DEB/build/bin/functions.pl line 375.
Use of uninitialized value $shortversion in hash element at /home/bamboo/ci/bamboo/xml-data/build-dir/POWEREDBY-PBO2015-DEB/build/bin/functions.pl line 375.
Use of uninitialized value $shortversion in hash element at /home/bamboo/ci/bamboo/xml-data/build-dir/POWEREDBY-PBO2015-DEB/build/bin/functions.pl line 377.
Argument "" isn't numeric in numeric lt (<) at /home/bamboo/ci/bamboo/xml-data/build-dir/POWEREDBY-PBO2015-DEB/build/bin/functions.pl line 385.
dch warning: new version (14.0.3-0.20170401.pbo2015.master.39) is less than
the current version number (14.0.3-1).
dpkg-source --before-build build
fakeroot debian/rules clean
dpkg-source -b build
dpkg-source: warning: no source format specified in debian/source/format, see dpkg-source(1)
dpkg-source: warning: source directory 'build' is not <sourcepackage>-<upstreamversion> 'opennms-14.0.3'
debian/rules build
Apr 07, 2017 12:50:08 PM org.apache.axis.utils.JavaUtils isAttachmentSupported
WARNING: Unable to find required classes (javax.activation.DataHandler and javax.mail.internet.MimeMultipart). Attachment support is disabled.
Apr 07, 2017 12:50:09 PM org.apache.axis.utils.JavaUtils isAttachmentSupported
WARNING: Unable to find required classes (javax.activation.DataHandler and javax.mail.internet.MimeMultipart). Attachment support is disabled.
asciidoctor: WARNING: conversion missing in backend pdf for inline_callout
asciidoctor: WARNING: conversion missing in backend pdf for inline_callout
asciidoctor: WARNING: conversion missing in backend pdf for inline_callout
asciidoctor: WARNING: conversion missing in backend pdf for inline_callout
asciidoctor: WARNING: conversion missing in backend pdf for inline_callout
asciidoctor: WARNING: conversion missing in backend pdf for inline_callout
asciidoctor: WARNING: conversion missing in backend pdf for inline_callout
asciidoctor: WARNING: conversion missing in backend pdf for inline_callout
asciidoctor: WARNING: conversion missing in backend pdf for inline_callout
asciidoctor: WARNING: conversion missing in backend pdf for inline_callout
asciidoctor: WARNING: conversion missing in backend pdf for inline_callout
asciidoctor: WARNING: conversion missing in backend pdf for inline_callout
asciidoctor: WARNING: conversion missing in backend pdf for inline_callout
asciidoctor: WARNING: conversion missing in backend pdf for inline_callout
asciidoctor: WARNING: conversion missing in backend pdf for inline_image
asciidoctor: WARNING: conversion missing in backend pdf for inline_image
asciidoctor: WARNING: conversion missing in backend pdf for inline_image
asciidoctor: WARNING: conversion missing in backend pdf for inline_image
asciidoctor: WARNING: conversion missing in backend pdf for inline_image
asciidoctor: WARNING: conversion missing in backend pdf for inline_image
asciidoctor: WARNING: conversion missing in backend pdf for inline_image
asciidoctor: WARNING: conversion missing in backend pdf for inline_image
asciidoctor: WARNING: conversion missing in backend pdf for inline_image
asciidoctor: WARNING: conversion missing in backend pdf for inline_image
asciidoctor: WARNING: conversion missing in backend pdf for inline_image
asciidoctor: WARNING: conversion missing in backend pdf for inline_image
asciidoctor: WARNING: conversion missing in backend pdf for inline_image
asciidoctor: WARNING: conversion missing in backend pdf for inline_image
asciidoctor: WARNING: conversion missing in backend pdf for inline_image
asciidoctor: WARNING: conversion missing in backend pdf for inline_image
asciidoctor: WARNING: conversion missing in backend pdf for inline_image
asciidoctor: WARNING: conversion missing in backend pdf for inline_image
asciidoctor: WARNING: conversion missing in backend pdf for inline_image
asciidoctor: WARNING: conversion missing in backend pdf for inline_image
asciidoctor: WARNING: conversion missing in backend pdf for inline_image
asciidoctor: WARNING: conversion missing in backend pdf for inline_image
asciidoctor: WARNING: conversion missing in backend pdf for inline_image
asciidoctor: WARNING: conversion missing in backend pdf for inline_image
asciidoctor: WARNING: conversion missing in backend pdf for inline_image
asciidoctor: WARNING: conversion missing in backend pdf for inline_image
asciidoctor: WARNING: conversion missing in backend pdf for inline_image
fakeroot debian/rules binary
dh_clean: dh_clean -k is deprecated; use dh_prep instead
dpkg-shlibdeps: warning: debian/opennms-common/usr/share/opennms/lib/linux64/librxtxSerial.so contains an unresolvable reference to symbol ceil: it's probably a plugin
dpkg-shlibdeps: error: couldn't find library libpthread.so.0 needed by debian/opennms-common/usr/share/opennms/lib/linux32/librxtxParallel.so (ELF format: 'elf32-i386'; RPATH: '')
dpkg-shlibdeps: error: couldn't find library libc.so.6 needed by debian/opennms-common/usr/share/opennms/lib/linux32/librxtxParallel.so (ELF format: 'elf32-i386'; RPATH: '')
dpkg-shlibdeps: error: couldn't find library libpthread.so.0 needed by debian/opennms-common/usr/share/opennms/lib/linux32/librxtxSerial.so (ELF format: 'elf32-i386'; RPATH: '')
dpkg-shlibdeps: error: couldn't find library libc.so.6 needed by debian/opennms-common/usr/share/opennms/lib/linux32/librxtxSerial.so (ELF format: 'elf32-i386'; RPATH: '')
dpkg-shlibdeps: error: cannot continue due to the errors listed above
Note: libraries are not searched in other binary packages that do not have any shlibs or symbols file.
To help dpkg-shlibdeps find private libraries, you might need to use -l.
dh_shlibdeps: dpkg-shlibdeps -Tdebian/opennms-common.substvars debian/opennms-common/usr/share/opennms/lib/linux64/librxtxSerial.so debian/opennms-common/usr/share/opennms/lib/linux32/librxtxSerial.so debian/opennms-common/usr/share/opennms/lib/linux32/librxtxParallel.so returned exit code 2
make: [binary-indep] Error 2 (ignored)
dpkg-gencontrol: warning: package opennms-db: unused substitution variable ${misc:Depends}
dpkg-gencontrol: warning: package opennms-plugin-protocol-xml: unused substitution variable ${perl:Depends}
dpkg-genchanges  >../opennms_14.0.3-0.20170401.pbo2015.master.39_amd64.changes
dpkg-genchanges: warning: the current version (14.0.3-0.20170401.pbo2015.master.39) is earlier than the previous one (14.0.3-1)
dpkg-genchanges: including full source code in upload
dpkg-source --after-build build