Build #50

Build result summary

Details

Completed
Duration
494 minutes
Labels
None
Revisions
OpenNMS (develop branch)
44ce76bb6b58bc21a65dc828d0a88b5b6a21baa9 44ce76bb6b58bc21a65dc828d0a88b5b6a21baa9
OpenNMS Installer
da12784d9ab4ba4aacedec0283d0c04075fd6ebf da12784d9ab4ba4aacedec0283d0c04075fd6ebf
OpenNMS-Repo
cacabc963c8e20c225ae81f81a69c8fe58ddc4c0 cacabc963c8e20c225ae81f81a69c8fe58ddc4c0
Smoke Tests
cb1e72265cf2ce10cb4872f58120272b340a1ce1 cb1e72265cf2ce10cb4872f58120272b340a1ce1
OpenNMS Bamboo Utils
a397f9c53e96a51f2f158b54cd15e82c19a00e57 a397f9c53e96a51f2f158b54cd15e82c19a00e57
OpenNMS System Test API
37d1c9d8432831a26f268e3b1199baa171787834 37d1c9d8432831a26f268e3b1199baa171787834
Total tests
6011
Fixed in
#54 (Changes by Jesse White)

Tests

Responsible

No one has taken responsibility for this failure

Code commits

OpenNMS (develop branch)
Author Commit Message Commit date
DavidSmith <38085611+smith-opennms@users.noreply.github.com> DavidSmith <38085611+smith-opennms@users.noreply.github.com> 44ce76bb6b58bc21a65dc828d0a88b5b6a21baa9 44ce76bb6b58bc21a65dc828d0a88b5b6a21baa9 NMS-11797: Telemetry Thresholding (#2567)
* NMS-11797: Telemetry Thresholding

* NMS-11797: addressing review feedback

Tests

New test failures 5
Status Test View job Duration
Collapse Failed ThresholdingIT canTriggerThresholds History
Integration Tests 4 secs
java.lang.AssertionError: expected:<0> but was:<1>
	at org.junit.Assert.fail(Assert.java:88)
	at org.junit.Assert.failNotEquals(Assert.java:834)
	at org.junit.Assert.assertEquals(Assert.java:645)
	at org.junit.Assert.assertEquals(Assert.java:631)
	at org.opennms.netmgt.telemetry.itests.ThresholdingIT.canTriggerThresholds(ThresholdingIT.java:206)
Collapse Failed EventsPageIT org.opennms.smoketest.EventsPageIT History
Smoke Tests 4 mins
org.testcontainers.containers.ContainerLaunchException: Container startup failed
Caused by: org.rnorth.ducttape.RetryCountExceededException: Retry limit hit with exception
Caused by: org.testcontainers.containers.ContainerLaunchException: Could not create/start container
Caused by: org.awaitility.core.ConditionTimeoutException: 
Lambda expression in org.opennms.smoketest.containers.OpenNMSContainer$WaitForOpenNMS: expected a string containing "Starter: Startup complete" but was "2019-07-09 23:28:58,680 DEBUG [Main] o.o.n.v.Starter: System property 'opennms.library.jicmp' already set to '/usr/lib64/libjicmp.so'.
2019-07-09 23:28:58,751 DEBUG [Main] o.o.n.v.Starter: System property 'opennms.library.jicmp6' already set to '/usr/lib64/libjicmp6.so'.
2019-07-09 23:28:58,752 DEBUG [Main] o.o.n.v.Starter: System property 'opennms.library.jrrd' not set.  Searching for file 'libjrrd.so' in the class path.
2019-07-09 23:28:58,752 WARN  [Main] o.o.n.v.Starter: Did not find file 'libjrrd.so' in the class path. Initialization of RRD code will likely fail if the JniRrdStrategy is used. Set the property 'opennms.library.jrrd' to the location of the file.
(281 more lines...)
Collapse Failed FocusedVertexIT org.opennms.smoketest.FocusedVertexIT History
Smoke Tests 4 mins
org.testcontainers.containers.ContainerLaunchException: Container startup failed
Caused by: org.rnorth.ducttape.RetryCountExceededException: Retry limit hit with exception
Caused by: org.testcontainers.containers.ContainerLaunchException: Could not create/start container
Caused by: org.awaitility.core.ConditionTimeoutException: 
Lambda expression in org.opennms.smoketest.containers.OpenNMSContainer$WaitForOpenNMS: expected a string containing "Starter: Startup complete" but was "2019-07-09 23:22:35,527 DEBUG [Main] o.o.n.v.Starter: System property 'opennms.library.jicmp' already set to '/usr/lib64/libjicmp.so'.
2019-07-09 23:22:35,566 DEBUG [Main] o.o.n.v.Starter: System property 'opennms.library.jicmp6' already set to '/usr/lib64/libjicmp6.so'.
2019-07-09 23:22:35,566 DEBUG [Main] o.o.n.v.Starter: System property 'opennms.library.jrrd' not set.  Searching for file 'libjrrd.so' in the class path.
2019-07-09 23:22:35,567 WARN  [Main] o.o.n.v.Starter: Did not find file 'libjrrd.so' in the class path. Initialization of RRD code will likely fail if the JniRrdStrategy is used. Set the property 'opennms.library.jrrd' to the location of the file.
(280 more lines...)
Collapse Failed EventSinkIT org.opennms.smoketest.minion.EventSinkIT History
Smoke Tests 4 mins
org.testcontainers.containers.ContainerLaunchException: Container startup failed
Caused by: org.rnorth.ducttape.RetryCountExceededException: Retry limit hit with exception
Caused by: org.testcontainers.containers.ContainerLaunchException: Could not create/start container
Caused by: org.awaitility.core.ConditionTimeoutException: 
Lambda expression in org.opennms.smoketest.containers.OpenNMSContainer$WaitForOpenNMS: expected a string containing "Starter: Startup complete" but was "2019-07-09 22:39:09,214 DEBUG [Main] o.o.n.v.Starter: System property 'opennms.library.jicmp' already set to '/usr/lib64/libjicmp.so'.
2019-07-09 22:39:09,257 DEBUG [Main] o.o.n.v.Starter: System property 'opennms.library.jicmp6' already set to '/usr/lib64/libjicmp6.so'.
2019-07-09 22:39:09,257 DEBUG [Main] o.o.n.v.Starter: System property 'opennms.library.jrrd' not set.  Searching for file 'libjrrd.so' in the class path.
2019-07-09 22:39:09,258 WARN  [Main] o.o.n.v.Starter: Did not find file 'libjrrd.so' in the class path. Initialization of RRD code will likely fail if the JniRrdStrategy is used. Set the property 'opennms.library.jrrd' to the location of the file.
(281 more lines...)
Collapse Failed BSMTopologyIT org.opennms.smoketest.topo.BSMTopologyIT History
Smoke Tests 4 mins
org.testcontainers.containers.ContainerLaunchException: Container startup failed
Caused by: org.rnorth.ducttape.RetryCountExceededException: Retry limit hit with exception
Caused by: org.testcontainers.containers.ContainerLaunchException: Could not create/start container
Caused by: org.awaitility.core.ConditionTimeoutException: 
Lambda expression in org.opennms.smoketest.containers.OpenNMSContainer$WaitForOpenNMS: expected a string containing "Starter: Startup complete" but was "2019-07-10 00:36:05,566 DEBUG [Main] o.o.n.v.Starter: System property 'opennms.library.jicmp' already set to '/usr/lib64/libjicmp.so'.
2019-07-10 00:36:05,638 DEBUG [Main] o.o.n.v.Starter: System property 'opennms.library.jicmp6' already set to '/usr/lib64/libjicmp6.so'.
2019-07-10 00:36:05,638 DEBUG [Main] o.o.n.v.Starter: System property 'opennms.library.jrrd' not set.  Searching for file 'libjrrd.so' in the class path.
2019-07-10 00:36:05,639 WARN  [Main] o.o.n.v.Starter: Did not find file 'libjrrd.so' in the class path. Initialization of RRD code will likely fail if the JniRrdStrategy is used. Set the property 'opennms.library.jrrd' to the location of the file.
(281 more lines...)

Jira issues

IssueDescriptionStatus
Unknown Issue TypeNMS-11797Could not obtain issue details from Jira