Build #2

Build: #2 failed Changes by 9 people

Test results

  • 3,815 tests in total
  • 34 tests failed
  • 34 failures are new
  • 132 tests were quarantined / skipped
  • 237 minutes taken in total.
New test failures 34
Status Test View job Duration
Collapse Failed LatencyStoringServiceMonitorAdaptorIT testThresholds History
Integration Test 2 secs
java.lang.AssertionError: 2 expected events still outstanding (expected 0):
 uei.opennms.org/threshold/highThresholdExceeded / 1 / 127.0.0.1 / ICMP
 uei.opennms.org/threshold/highThresholdRearmed / 1 / 127.0.0.1 / ICMP
java.lang.AssertionError: 2 expected events still outstanding (expected 0):
	uei.opennms.org/threshold/highThresholdExceeded / 1 / 127.0.0.1 / ICMP
	uei.opennms.org/threshold/highThresholdRearmed / 1 / 127.0.0.1 / ICMP
	at org.junit.Assert.fail(Assert.java:88)
	at org.opennms.netmgt.dao.mock.EventAnticipator.verifyAnticipated(EventAnticipator.java:239)
(2 more lines...)
Collapse Failed LatencyThresholdingSetIT testCounterReset History
Integration Test < 1 sec
java.lang.AssertionError: null
	at org.junit.Assert.fail(Assert.java:86)
	at org.junit.Assert.assertTrue(Assert.java:41)
	at org.junit.Assert.assertTrue(Assert.java:52)
	at org.opennms.netmgt.threshd.LatencyThresholdingSetIT.testCounterReset(LatencyThresholdingSetIT.java:429)
Collapse Failed LatencyThresholdingSetIT testBug3488 History
Integration Test < 1 sec
java.lang.AssertionError: null
	at org.junit.Assert.fail(Assert.java:86)
	at org.junit.Assert.assertTrue(Assert.java:41)
	at org.junit.Assert.assertTrue(Assert.java:52)
	at org.opennms.netmgt.threshd.LatencyThresholdingSetIT.testBug3488(LatencyThresholdingSetIT.java:278)
Collapse Failed LatencyThresholdingSetIT testBug3575 History
Integration Test < 1 sec
java.lang.AssertionError: null
	at org.junit.Assert.fail(Assert.java:86)
	at org.junit.Assert.assertTrue(Assert.java:41)
	at org.junit.Assert.assertTrue(Assert.java:52)
	at org.opennms.netmgt.threshd.LatencyThresholdingSetIT.testBug3575(LatencyThresholdingSetIT.java:310)
Collapse Failed LatencyThresholdingSetIT testLatencyThresholdingSet History
Integration Test < 1 sec
java.lang.AssertionError: null
	at org.junit.Assert.fail(Assert.java:86)
	at org.junit.Assert.assertTrue(Assert.java:41)
	at org.junit.Assert.assertTrue(Assert.java:52)
	at org.opennms.netmgt.threshd.LatencyThresholdingSetIT.testLatencyThresholdingSet(LatencyThresholdingSetIT.java:351)
Collapse Failed ThresholdingVisitorIT testResourceGaugeData History
Integration Test < 1 sec
java.lang.AssertionError: Anticipated event count (1) is different from received event count (0).
	at org.junit.Assert.fail(Assert.java:88)
	at org.opennms.netmgt.threshd.ThresholdingVisitorIT.verifyEvents(ThresholdingVisitorIT.java:1943)
	at org.opennms.netmgt.threshd.ThresholdingVisitorIT.testResourceGaugeData(ThresholdingVisitorIT.java:298)
Collapse Failed ThresholdingVisitorIT testReloadThresholdsConfig History
Integration Test < 1 sec
java.lang.AssertionError: Anticipated event count (1) is different from received event count (0).
	at org.junit.Assert.fail(Assert.java:88)
	at org.opennms.netmgt.threshd.ThresholdingVisitorIT.verifyEvents(ThresholdingVisitorIT.java:1943)
	at org.opennms.netmgt.threshd.ThresholdingVisitorIT.testReloadThresholdsConfig(ThresholdingVisitorIT.java:525)
Collapse Failed ThresholdingVisitorIT testInterfaceResourceWithStringAttributeFilter History
Integration Test < 1 sec
java.lang.AssertionError: Anticipated event count (2) is different from received event count (0).
	at org.junit.Assert.fail(Assert.java:88)
	at org.opennms.netmgt.threshd.ThresholdingVisitorIT.verifyEvents(ThresholdingVisitorIT.java:1943)
	at org.opennms.netmgt.threshd.ThresholdingVisitorIT.testInterfaceResourceWithStringAttributeFilter(ThresholdingVisitorIT.java:496)
Collapse Failed ThresholdingVisitorIT testBug2746 History
Integration Test < 1 sec
java.lang.AssertionError: Anticipated event count (1) is different from received event count (0).
	at org.junit.Assert.fail(Assert.java:88)
	at org.opennms.netmgt.threshd.ThresholdingVisitorIT.verifyEvents(ThresholdingVisitorIT.java:1943)
	at org.opennms.netmgt.threshd.ThresholdingVisitorIT.testBug2746(ThresholdingVisitorIT.java:690)
Collapse Failed ThresholdingVisitorIT testBug3333 History
Integration Test < 1 sec
java.lang.AssertionError: Anticipated event count (1) is different from received event count (0).
	at org.junit.Assert.fail(Assert.java:88)
	at org.opennms.netmgt.threshd.ThresholdingVisitorIT.verifyEvents(ThresholdingVisitorIT.java:1943)
	at org.opennms.netmgt.threshd.ThresholdingVisitorIT.testBug3333(ThresholdingVisitorIT.java:974)
Collapse Failed ThresholdingVisitorIT testTriggersNodeResource History
Integration Test < 1 sec
java.lang.AssertionError: Anticipated event count (1) is different from received event count (0).
	at org.junit.Assert.fail(Assert.java:88)
	at org.opennms.netmgt.threshd.ThresholdingVisitorIT.verifyEvents(ThresholdingVisitorIT.java:1943)
	at org.opennms.netmgt.threshd.ThresholdingVisitorIT.testTriggersNodeResource(ThresholdingVisitorIT.java:325)
Collapse Failed ThresholdingVisitorIT testBug5258 History
Integration Test < 1 sec
java.lang.AssertionError: Anticipated event count (3) is different from received event count (1).
	at org.junit.Assert.fail(Assert.java:88)
	at org.opennms.netmgt.threshd.ThresholdingVisitorIT.verifyEvents(ThresholdingVisitorIT.java:1943)
	at org.opennms.netmgt.threshd.ThresholdingVisitorIT.testBug5258(ThresholdingVisitorIT.java:1350)
Collapse Failed ThresholdingVisitorIT testBug3194_32bits History
Integration Test < 1 sec
java.lang.AssertionError: Anticipated event count (1) is different from received event count (0).
	at org.junit.Assert.fail(Assert.java:88)
	at org.opennms.netmgt.threshd.ThresholdingVisitorIT.verifyEvents(ThresholdingVisitorIT.java:1943)
	at org.opennms.netmgt.threshd.ThresholdingVisitorIT.runCounterWrapTest(ThresholdingVisitorIT.java:1783)
	at org.opennms.netmgt.threshd.ThresholdingVisitorIT.testBug3194_32bits(ThresholdingVisitorIT.java:949)
Collapse Failed ThresholdingVisitorIT testBug3193 History
Integration Test < 1 sec
java.lang.AssertionError: Anticipated event count (4) is different from received event count (0).
	at org.junit.Assert.fail(Assert.java:88)
	at org.opennms.netmgt.threshd.ThresholdingVisitorIT.verifyEvents(ThresholdingVisitorIT.java:1943)
	at org.opennms.netmgt.threshd.ThresholdingVisitorIT.testBug3193(ThresholdingVisitorIT.java:885)
Collapse Failed ThresholdingVisitorIT testTriggersGenericResource History
Integration Test < 1 sec
java.lang.AssertionError: Anticipated event count (1) is different from received event count (0).
	at org.junit.Assert.fail(Assert.java:88)
	at org.opennms.netmgt.threshd.ThresholdingVisitorIT.verifyEvents(ThresholdingVisitorIT.java:1943)
	at org.opennms.netmgt.threshd.ThresholdingVisitorIT.testTriggersGenericResource(ThresholdingVisitorIT.java:352)
Collapse Failed ThresholdingVisitorIT testResourceCounterData History
Integration Test < 1 sec
java.lang.AssertionError: Anticipated event count (2) is different from received event count (0).
	at org.junit.Assert.fail(Assert.java:88)
	at org.opennms.netmgt.threshd.ThresholdingVisitorIT.verifyEvents(ThresholdingVisitorIT.java:1943)
	at org.opennms.netmgt.threshd.ThresholdingVisitorIT.testResourceCounterData(ThresholdingVisitorIT.java:399)
Collapse Failed ThresholdingVisitorIT testThresholdFiltersOnGenericResourceWithSiblingColumnStorageStrategy History
Integration Test < 1 sec
java.lang.AssertionError: Anticipated event count (1) is different from received event count (0).
	at org.junit.Assert.fail(Assert.java:88)
	at org.opennms.netmgt.threshd.ThresholdingVisitorIT.verifyEvents(ThresholdingVisitorIT.java:1943)
	at org.opennms.netmgt.threshd.ThresholdingVisitorIT.testThresholdFiltersOnGenericResourceWithSiblingColumnStorageStrategy(ThresholdingVisitorIT.java:1654)
Collapse Failed ThresholdingVisitorIT testNMS5115 History
Integration Test < 1 sec
java.lang.AssertionError: Anticipated event count (1) is different from received event count (0).
	at org.junit.Assert.fail(Assert.java:88)
	at org.opennms.netmgt.threshd.ThresholdingVisitorIT.verifyEvents(ThresholdingVisitorIT.java:1943)
	at org.opennms.netmgt.threshd.ThresholdingVisitorIT.testNMS5115(ThresholdingVisitorIT.java:1124)
Collapse Failed ThresholdingVisitorIT testNumericThresholdFiltersOnGenericResource History
Integration Test < 1 sec
java.lang.AssertionError: Anticipated event count (1) is different from received event count (0).
	at org.junit.Assert.fail(Assert.java:88)
	at org.opennms.netmgt.threshd.ThresholdingVisitorIT.verifyEvents(ThresholdingVisitorIT.java:1943)
	at org.opennms.netmgt.threshd.ThresholdingVisitorIT.testNumericThresholdFiltersOnGenericResource(ThresholdingVisitorIT.java:1487)
Collapse Failed ThresholdingVisitorIT testBug3146_reduceTrigger History
Integration Test < 1 sec
java.lang.AssertionError: Anticipated event count (4) is different from received event count (1).
	at org.junit.Assert.fail(Assert.java:88)
	at org.opennms.netmgt.threshd.ThresholdingVisitorIT.verifyEvents(ThresholdingVisitorIT.java:1943)
	at org.opennms.netmgt.threshd.ThresholdingVisitorIT.testBug3146_reduceTrigger(ThresholdingVisitorIT.java:754)
Collapse Failed ThresholdingVisitorIT testThresholdsFiltersOnNodeResource History
Integration Test < 1 sec
java.lang.AssertionError: Anticipated event count (2) is different from received event count (0).
	at org.junit.Assert.fail(Assert.java:88)
	at org.opennms.netmgt.threshd.ThresholdingVisitorIT.verifyEvents(ThresholdingVisitorIT.java:1943)
	at org.opennms.netmgt.threshd.ThresholdingVisitorIT.testThresholdsFiltersOnNodeResource(ThresholdingVisitorIT.java:1528)
Collapse Failed ThresholdingVisitorIT testBug3748 History
Integration Test < 1 sec
java.lang.AssertionError: Anticipated event count (1) is different from received event count (0).
	at org.junit.Assert.fail(Assert.java:88)
	at org.opennms.netmgt.threshd.ThresholdingVisitorIT.verifyEvents(ThresholdingVisitorIT.java:1943)
	at org.opennms.netmgt.threshd.ThresholdingVisitorIT.testBug3748(ThresholdingVisitorIT.java:1098)
Collapse Failed ThresholdingVisitorIT testInterfaceResourceWithDBAttributeFilter History
Integration Test < 1 sec
java.lang.AssertionError: Anticipated event count (2) is different from received event count (0).
	at org.junit.Assert.fail(Assert.java:88)
	at org.opennms.netmgt.threshd.ThresholdingVisitorIT.verifyEvents(ThresholdingVisitorIT.java:1943)
	at org.opennms.netmgt.threshd.ThresholdingVisitorIT.testInterfaceResourceWithDBAttributeFilter(ThresholdingVisitorIT.java:469)
Collapse Failed ThresholdingVisitorIT testBug3146_replaceThreshold History
Integration Test < 1 sec
java.lang.AssertionError: Anticipated event count (3) is different from received event count (1).
	at org.junit.Assert.fail(Assert.java:88)
	at org.opennms.netmgt.threshd.ThresholdingVisitorIT.verifyEvents(ThresholdingVisitorIT.java:1943)
	at org.opennms.netmgt.threshd.ThresholdingVisitorIT.testBug3146_replaceThreshold(ThresholdingVisitorIT.java:833)
Collapse Failed ThresholdingVisitorIT testZeroIntervalResourceCounterData History
Integration Test < 1 sec
java.lang.AssertionError: Anticipated event count (2) is different from received event count (0).
	at org.junit.Assert.fail(Assert.java:88)
	at org.opennms.netmgt.threshd.ThresholdingVisitorIT.verifyEvents(ThresholdingVisitorIT.java:1943)
	at org.opennms.netmgt.threshd.ThresholdingVisitorIT.testZeroIntervalResourceCounterData(ThresholdingVisitorIT.java:448)
Collapse Failed ThresholdingVisitorIT testBug3664 History
Integration Test < 1 sec
java.lang.AssertionError: Anticipated event count (2) is different from received event count (0).
	at org.junit.Assert.fail(Assert.java:88)
	at org.opennms.netmgt.threshd.ThresholdingVisitorIT.verifyEvents(ThresholdingVisitorIT.java:1943)
	at org.opennms.netmgt.threshd.ThresholdingVisitorIT.testBug3664(ThresholdingVisitorIT.java:1305)
Collapse Failed ThresholdingVisitorIT testThresholdsFiltersOnNodeResourceWithCollectionSetBuilder History
Integration Test < 1 sec
java.lang.AssertionError: Anticipated event count (2) is different from received event count (0).
	at org.junit.Assert.fail(Assert.java:88)
	at org.opennms.netmgt.threshd.ThresholdingVisitorIT.verifyEvents(ThresholdingVisitorIT.java:1943)
	at org.opennms.netmgt.threshd.ThresholdingVisitorIT.testThresholdsFiltersOnNodeResourceWithCollectionSetBuilder(ThresholdingVisitorIT.java:1566)
Collapse Failed ThresholdingVisitorIT testBug2711_noIpAddress History
Integration Test < 1 sec
java.lang.AssertionError: Anticipated event count (2) is different from received event count (0).
	at org.junit.Assert.fail(Assert.java:88)
	at org.opennms.netmgt.threshd.ThresholdingVisitorIT.verifyEvents(ThresholdingVisitorIT.java:1943)
	at org.opennms.netmgt.threshd.ThresholdingVisitorIT.runTestForBug2711(ThresholdingVisitorIT.java:1138)
	at org.opennms.netmgt.threshd.ThresholdingVisitorIT.testBug2711_noIpAddress(ThresholdingVisitorIT.java:897)
Collapse Failed ThresholdingVisitorIT testBug3428_match History
Integration Test < 1 sec
java.lang.AssertionError: Anticipated event count (1) is different from received event count (0).
	at org.junit.Assert.fail(Assert.java:88)
	at org.opennms.netmgt.threshd.ThresholdingVisitorIT.verifyEvents(ThresholdingVisitorIT.java:1943)
	at org.opennms.netmgt.threshd.ThresholdingVisitorIT.testBug3428_match(ThresholdingVisitorIT.java:1254)
Collapse Failed ThresholdingVisitorIT testBug3194_64bits History
Integration Test < 1 sec
java.lang.AssertionError: Anticipated event count (1) is different from received event count (0).
	at org.junit.Assert.fail(Assert.java:88)
	at org.opennms.netmgt.threshd.ThresholdingVisitorIT.verifyEvents(ThresholdingVisitorIT.java:1943)
	at org.opennms.netmgt.threshd.ThresholdingVisitorIT.runCounterWrapTest(ThresholdingVisitorIT.java:1783)
	at org.opennms.netmgt.threshd.ThresholdingVisitorIT.testBug3194_64bits(ThresholdingVisitorIT.java:957)
Collapse Failed ThresholdingVisitorIT testBug3146_unrelatedChange History
Integration Test < 1 sec
java.lang.AssertionError: Anticipated event count (2) is different from received event count (0).
	at org.junit.Assert.fail(Assert.java:88)
	at org.opennms.netmgt.threshd.ThresholdingVisitorIT.verifyEvents(ThresholdingVisitorIT.java:1943)
	at org.opennms.netmgt.threshd.ThresholdingVisitorIT.testBug3146_unrelatedChange(ThresholdingVisitorIT.java:716)
Collapse Failed ThresholdingVisitorIT testThresholdFiltersOnGenericResource History
Integration Test < 1 sec
java.lang.AssertionError: Anticipated event count (2) is different from received event count (0).
	at org.junit.Assert.fail(Assert.java:88)
	at org.opennms.netmgt.threshd.ThresholdingVisitorIT.verifyEvents(ThresholdingVisitorIT.java:1943)
	at org.opennms.netmgt.threshd.ThresholdingVisitorIT.testThresholdFiltersOnGenericResource(ThresholdingVisitorIT.java:1468)
Collapse Failed ThresholdingVisitorIT testThresholdFiltersOnGenericResourceWithCollectionSetBuilder History
Integration Test < 1 sec
java.lang.AssertionError: Anticipated event count (2) is different from received event count (0).
	at org.junit.Assert.fail(Assert.java:88)
	at org.opennms.netmgt.threshd.ThresholdingVisitorIT.verifyEvents(ThresholdingVisitorIT.java:1943)
	at org.opennms.netmgt.threshd.ThresholdingVisitorIT.testThresholdFiltersOnGenericResourceWithCollectionSetBuilder(ThresholdingVisitorIT.java:1586)
Collapse Failed ThresholdingVisitorIT testBug3146_inceaseTrigger History
Integration Test < 1 sec
java.lang.AssertionError: Anticipated event count (2) is different from received event count (1).
	at org.junit.Assert.fail(Assert.java:88)
	at org.opennms.netmgt.threshd.ThresholdingVisitorIT.verifyEvents(ThresholdingVisitorIT.java:1943)
	at org.opennms.netmgt.threshd.ThresholdingVisitorIT.testBug3146_inceaseTrigger(ThresholdingVisitorIT.java:782)
Skipped tests 100
Status Test Failing since View job
Skipped HeartbeatSinkBlueprintIT org.opennms.core.ipc.sink.camel.itests.HeartbeatSinkBlueprintIT History
Integration Test
Skipped HeartbeatSinkPerfIT org.opennms.core.ipc.sink.camel.itests.HeartbeatSinkPerfIT History
Integration Test
Skipped SinkBlueprintMessageFailureIT org.opennms.core.ipc.sink.camel.itests.SinkBlueprintMessageFailureIT History
Integration Test
Skipped HeartbeatSinkIT canConsumeMessagesInParallel History
Integration Test
Skipped EchoRpcBlueprintIT org.opennms.core.rpc.aws.sqs.EchoRpcBlueprintIT History
Integration Test
Skipped EchoRpcIT org.opennms.core.rpc.aws.sqs.EchoRpcIT History
Integration Test
Skipped EchoRpcThreadIT org.opennms.core.rpc.aws.sqs.EchoRpcThreadIT History
Integration Test
Skipped InstallerDbIT testIfServicesServiceIdColumnConvertToNotNull History
Integration Test
Skipped InstallerDbIT testCatchSnmpInterfaceNullNodeIdColumnOnUpgrade History
Integration Test
Skipped InstallerDbIT testSomethingUnknown History
Integration Test
Skipped InstallerDbIT testCatchIpInterfaceHasNullIpAddrValueOnUpgrade History
Integration Test
Skipped InstallerDbIT testOutagesServiceIdColumnConvertToNotNull History
Integration Test
Skipped InstallerDbIT testCatchSnmpInterfaceHasNullNodeIdValueOnUpgrade History
Integration Test
Skipped InstallerDbIT testSetOutageIdOnUpgrade History
Integration Test
Skipped InstallerDbIT testOutagesNodeIdColumnConvertToNotNull History
Integration Test
Skipped InstallerDbIT testSetUsersNotifiedIdOnUpgrade History
Integration Test
Skipped InstallerDbIT testSetEventSourceOnUpgrade History
Integration Test
Skipped InstallerDbIT testSnmpInterfaceNodeIdColumnConvertToNotNull History
Integration Test
Skipped InstallerDbIT testCatchIpInterfaceNullIpAddrColumnOnUpgrade History
Integration Test
Skipped InstallerDbIT testOutagesForeignKeyIfServiceIdOnUpgrade History
Integration Test
Skipped InstallerDbIT testUpgradeRevision3952ToCurrentWithData History
Integration Test
Skipped InstallerDbIT testIfServicesNodeIdColumnConvertToNotNull History
Integration Test
Skipped InstallerDbIT testIfServicesIpAddrColumnConvertToNotNull History
Integration Test
Skipped InstallerDbIT testIfServicesForeignKeyIpInterfaceIdOnUpgrade History
Integration Test
Skipped InstallerDbIT testSetSnmpInterfaceIdOnUpgrade History
Integration Test
Skipped InstallerDbIT testSnmpInterfaceSnmpIfIndexColumnConvertToNotNull History
Integration Test
Skipped InstallerDbIT testBug1574 History
Integration Test
Skipped InstallerDbIT testIpInterfaceNodeIdColumnConvertToNotNull History
Integration Test
Skipped InstallerDbIT testUpgradeRevision3952ToCurrent History
Integration Test
Skipped InstallerDbIT testAssetsIdOnUpgrade History
Integration Test
Skipped InstallerDbIT testIpInterfaceForeignKeySnmpInterfaceIdOnUpgrade History
Integration Test
Skipped InstallerDbIT testOutagesIfServiceIdColumnConvertToNotNull History
Integration Test
Skipped InstallerDbIT testUpgradeColumnToNotNullWithDefault History
Integration Test
Skipped TemporaryDatabaseExecutionListenerNoClassAnnotationIT org.opennms.core.test.db.TemporaryDatabaseExecutionListenerNoClassAnnotationIT History
Integration Test
Skipped GenericURLStreamHandlerTest testFailToCreateURLStreamHandler History
Integration Test
Skipped JavaMailerTest testJavaMailerWithNullMessageText History
Integration Test
Skipped JavaMailerTest testJavaMailerWithEmptySubject History
Integration Test
Skipped JavaMailerTest testJavaMailerWithEmptyMessageText History
Integration Test
Skipped JavaMailerTest testJavaMailerWithNullTo History
Integration Test
Skipped JavaMailerTest testJavaMailerWithDefaults History
Integration Test
Skipped JavaMailerTest testJavaMailerWithEmptyFrom History
Integration Test
Skipped JavaMailerTest testJavaMailerWithNullSubject History
Integration Test
Skipped JavaMailerTest testJavaMailerWithNullFrom History
Integration Test
Skipped JavaMailerTest testJavaMailerWithEmptyTo History
Integration Test
Skipped JavaReadMailerTest testGetText History
Integration Test
Skipped JavaReadMailerTest testReadMessagesWithSearchTerm History
Integration Test
Skipped NativeSocketTest org.opennms.jicmp.jna.NativeSocketTest History
Integration Test
Skipped PingThreadIT org.opennms.jicmp.standalone.PingThreadIT History
Integration Test
Skipped EventConfDataTest testV1EnterpriseIdAndGenericAndSpecificAndMatchWithVarbindsAndTC History
Integration Test
Skipped AlarmDaoIT testWithoutDistPoller History
Integration Test
Skipped AuthorizationIT testGetCategoriesWithAuthorizedGroups History
Integration Test
Skipped DefaultDataCollectionConfigDaoIT testLoadTimeOfDao History
Integration Test
Skipped JaxbUtilsTest testValidationMemoryLeak History
Integration Test
Skipped MonitoredServiceDaoIT testCriteriaBuilderWithApplicationAlias History
Integration Test
Skipped NodeDaoIT testCriteriaBuilderWithCategoryAlias History
Integration Test
Skipped MemoryLeakIT testMemory History
Integration Test
Skipped JnaPingIT testPingCallbackTimeoutIPv4 History
Integration Test
Skipped JnaPingIT testPingCallbackTimeoutIPv6 History
Integration Test
Skipped JnaPingIT testParallelPingFailureIPv6 History
Integration Test
Skipped JnaPingIT testParallelPingFailureIPv4 History
Integration Test
Skipped JnaPingIT testSinglePingFailureIPv4 History
Integration Test
Skipped JnaPingIT testSinglePingFailureIPv6 History
Integration Test
Skipped JnaPingIT testParallelPingIPv4 History
Integration Test
Skipped JnaPingIT testParallelPingIPv6 History
Integration Test
Skipped JnaPingIT testSinglePingIPv4 History
Integration Test
Skipped JnaPingIT testSinglePingIPv6 History
Integration Test
Skipped Jni6PingIT testSinglePingFailureJni History
Integration Test
Skipped Jni6PingIT testParallelPingFailureJni History
Integration Test
Skipped Jni6PingIT testSinglePingJni History
Integration Test
Skipped Jni6PingIT testPingCallbackTimeoutJni History
Integration Test
Skipped Jni6PingIT testParallelPingJni History
Integration Test
Skipped JniPingIT testPingCallbackTimeoutJni History
Integration Test
Skipped JniPingIT testSinglePingFailureJni History
Integration Test
Skipped JniPingIT testParallelPingJni History
Integration Test
Skipped JniPingIT testParallelPingFailureJni History
Integration Test
Skipped JniPingIT testSinglePingJni History
Integration Test
Skipped LocationAwarePingSweepClientIT canPingViaRemoteLocation History
Integration Test
Skipped LocationAwarePingSweepClientIT canPingViaLocalhost History
Integration Test
Skipped MicroblogClientTest testOAuthRegistration History
Integration Test
Skipped MicroblogDMNotificationStrategyTest postNotice History
Integration Test
Skipped MicroblogNotificationStrategyIT postNotice History
Integration Test
Skipped MicroblogReplyNotificationStrategyTest postNotice History
Integration Test
Skipped NotifdIT testNewSuspect History
Integration Test
Skipped NotificationsITCase org.opennms.netmgt.notifd.NotificationsITCase History
Integration Test
Skipped XMPPNotificationTest testGroupNotification History
Integration Test
Skipped XMPPNotificationTest testNotification History
Integration Test
Skipped HttpMonitorIT testTimeout History
Integration Test
Skipped MailTransportMonitorTest testEndToEnd History
Integration Test
Skipped MailTransportMonitorTest readOnlyTest History
Integration Test
Skipped PageSequenceMonitorIT testVirtualHostBadBehaviorForWordpressPlugin History
Integration Test
Skipped PageSequenceMonitorIT testHttpsWithHostValidation History
Integration Test
Skipped PageSequenceMonitorIT testHttpsWithoutHostValidation History
Integration Test
Skipped PageSequenceMonitorIT testHttps History
Integration Test
Skipped PageSequenceMonitorOpenNMSTest testOpenNMSUserInterface History
Integration Test
Skipped SSLCertMonitorIT testInternetWebsite History
Integration Test
Skipped PathOutageManagerDaoIT testMethod500Times History
Integration Test
Skipped PollerIT testBug1564 History
Integration Test
Skipped PollerQueryManagerDaoIT testBug1564 History
Integration Test
Skipped AsyncDetectorFileDescriptorLeakTest org.opennms.netmgt.provision.detector.AsyncDetectorFileDescriptorLeakTest History
Integration Test
Skipped LocationAwareDetectorClientIT org.opennms.netmgt.provision.detector.client.rpc.LocationAwareDetectorClientIT History
Integration Test