Build #2

Build: #2 failed Changes by 9 people

Build result summary

Details

Completed
Duration
287 minutes
Labels
None
Revisions
ONMSDEV
9c72177873991bd8372ccf493a2bef59b2552b76 9c72177873991bd8372ccf493a2bef59b2552b76
OpenNMS Installer
da12784d9ab4ba4aacedec0283d0c04075fd6ebf da12784d9ab4ba4aacedec0283d0c04075fd6ebf
OpenNMS-Repo
088d710674109759251f42c6720d74ea80cf3f13 088d710674109759251f42c6720d74ea80cf3f13
Smoke Tests
cb1e72265cf2ce10cb4872f58120272b340a1ce1 cb1e72265cf2ce10cb4872f58120272b340a1ce1
OpenNMS Bamboo Utils
a6d144f81c2df6f267b94e79328a0c8497980837 a6d144f81c2df6f267b94e79328a0c8497980837
OpenNMS System Test API
38d1a693589d2d93b67a70d090bc19df37de1e7f 38d1a693589d2d93b67a70d090bc19df37de1e7f
Total tests
3815
Fixed in
#4 (Changes by Pavan Kumar RP <pavan.kumarrp@cerner.com>)

Tests

Responsible

Code commits

ONMSDEV
Author Commit Message Commit date
Cerner OpenNMS Developers Cerner OpenNMS Developers 9c72177873991bd8372ccf493a2bef59b2552b76 9c72177873991bd8372ccf493a2bef59b2552b76 Merge pull request #1 from pavanrp1/cerner-develop
Cerner develop
Pavan Kumar RP <pavan.kumarrp@cerner.com> Pavan Kumar RP <pavan.kumarrp@cerner.com> d64258db61bd80716f17d88e5ed9a9e5c137707a d64258db61bd80716f17d88e5ed9a9e5c137707a Changes for Events for every threshold
Malatesh Malatesh 216428ec2af6b965114014dd2575d38854ac5321 216428ec2af6b965114014dd2575d38854ac5321 Merge remote-tracking branch 'mala/develop_eventConsumer' into cerner-develop
Chandra Gorantla <chandra@opennms.com> Chandra Gorantla <chandra@opennms.com> 25003585d93ed9fd0dd87bac6a7ba010f330cd1f 25003585d93ed9fd0dd87bac6a7ba010f330cd1f hzn-1331: Add doc
Chandra Gorantla <chandra@opennms.com> Chandra Gorantla <chandra@opennms.com> 8f43849de28db453cd0971ea09bd5cf23d0e6246 8f43849de28db453cd0971ea09bd5cf23d0e6246 hzn-1331: Conditionally load eventSink, add smoke-test

Tests

New test failures 34
Status Test View job Duration
Collapse Failed LatencyStoringServiceMonitorAdaptorIT testThresholds History
Integration Test 2 secs
java.lang.AssertionError: 2 expected events still outstanding (expected 0):
 uei.opennms.org/threshold/highThresholdExceeded / 1 / 127.0.0.1 / ICMP
 uei.opennms.org/threshold/highThresholdRearmed / 1 / 127.0.0.1 / ICMP
java.lang.AssertionError: 2 expected events still outstanding (expected 0):
	uei.opennms.org/threshold/highThresholdExceeded / 1 / 127.0.0.1 / ICMP
	uei.opennms.org/threshold/highThresholdRearmed / 1 / 127.0.0.1 / ICMP
	at org.junit.Assert.fail(Assert.java:88)
	at org.opennms.netmgt.dao.mock.EventAnticipator.verifyAnticipated(EventAnticipator.java:239)
(2 more lines...)
Collapse Failed LatencyThresholdingSetIT testCounterReset History
Integration Test < 1 sec
java.lang.AssertionError: null
	at org.junit.Assert.fail(Assert.java:86)
	at org.junit.Assert.assertTrue(Assert.java:41)
	at org.junit.Assert.assertTrue(Assert.java:52)
	at org.opennms.netmgt.threshd.LatencyThresholdingSetIT.testCounterReset(LatencyThresholdingSetIT.java:429)
Collapse Failed LatencyThresholdingSetIT testBug3488 History
Integration Test < 1 sec
java.lang.AssertionError: null
	at org.junit.Assert.fail(Assert.java:86)
	at org.junit.Assert.assertTrue(Assert.java:41)
	at org.junit.Assert.assertTrue(Assert.java:52)
	at org.opennms.netmgt.threshd.LatencyThresholdingSetIT.testBug3488(LatencyThresholdingSetIT.java:278)
Collapse Failed LatencyThresholdingSetIT testBug3575 History
Integration Test < 1 sec
java.lang.AssertionError: null
	at org.junit.Assert.fail(Assert.java:86)
	at org.junit.Assert.assertTrue(Assert.java:41)
	at org.junit.Assert.assertTrue(Assert.java:52)
	at org.opennms.netmgt.threshd.LatencyThresholdingSetIT.testBug3575(LatencyThresholdingSetIT.java:310)
Collapse Failed LatencyThresholdingSetIT testLatencyThresholdingSet History
Integration Test < 1 sec
java.lang.AssertionError: null
	at org.junit.Assert.fail(Assert.java:86)
	at org.junit.Assert.assertTrue(Assert.java:41)
	at org.junit.Assert.assertTrue(Assert.java:52)
	at org.opennms.netmgt.threshd.LatencyThresholdingSetIT.testLatencyThresholdingSet(LatencyThresholdingSetIT.java:351)
Collapse Failed ThresholdingVisitorIT testResourceGaugeData History
Integration Test < 1 sec
java.lang.AssertionError: Anticipated event count (1) is different from received event count (0).
	at org.junit.Assert.fail(Assert.java:88)
	at org.opennms.netmgt.threshd.ThresholdingVisitorIT.verifyEvents(ThresholdingVisitorIT.java:1943)
	at org.opennms.netmgt.threshd.ThresholdingVisitorIT.testResourceGaugeData(ThresholdingVisitorIT.java:298)
Collapse Failed ThresholdingVisitorIT testReloadThresholdsConfig History
Integration Test < 1 sec
java.lang.AssertionError: Anticipated event count (1) is different from received event count (0).
	at org.junit.Assert.fail(Assert.java:88)
	at org.opennms.netmgt.threshd.ThresholdingVisitorIT.verifyEvents(ThresholdingVisitorIT.java:1943)
	at org.opennms.netmgt.threshd.ThresholdingVisitorIT.testReloadThresholdsConfig(ThresholdingVisitorIT.java:525)
Collapse Failed ThresholdingVisitorIT testInterfaceResourceWithStringAttributeFilter History
Integration Test < 1 sec
java.lang.AssertionError: Anticipated event count (2) is different from received event count (0).
	at org.junit.Assert.fail(Assert.java:88)
	at org.opennms.netmgt.threshd.ThresholdingVisitorIT.verifyEvents(ThresholdingVisitorIT.java:1943)
	at org.opennms.netmgt.threshd.ThresholdingVisitorIT.testInterfaceResourceWithStringAttributeFilter(ThresholdingVisitorIT.java:496)
Collapse Failed ThresholdingVisitorIT testBug2746 History
Integration Test < 1 sec
java.lang.AssertionError: Anticipated event count (1) is different from received event count (0).
	at org.junit.Assert.fail(Assert.java:88)
	at org.opennms.netmgt.threshd.ThresholdingVisitorIT.verifyEvents(ThresholdingVisitorIT.java:1943)
	at org.opennms.netmgt.threshd.ThresholdingVisitorIT.testBug2746(ThresholdingVisitorIT.java:690)
Collapse Failed ThresholdingVisitorIT testBug3333 History
Integration Test < 1 sec
java.lang.AssertionError: Anticipated event count (1) is different from received event count (0).
	at org.junit.Assert.fail(Assert.java:88)
	at org.opennms.netmgt.threshd.ThresholdingVisitorIT.verifyEvents(ThresholdingVisitorIT.java:1943)
	at org.opennms.netmgt.threshd.ThresholdingVisitorIT.testBug3333(ThresholdingVisitorIT.java:974)
Collapse Failed ThresholdingVisitorIT testTriggersNodeResource History
Integration Test < 1 sec
java.lang.AssertionError: Anticipated event count (1) is different from received event count (0).
	at org.junit.Assert.fail(Assert.java:88)
	at org.opennms.netmgt.threshd.ThresholdingVisitorIT.verifyEvents(ThresholdingVisitorIT.java:1943)
	at org.opennms.netmgt.threshd.ThresholdingVisitorIT.testTriggersNodeResource(ThresholdingVisitorIT.java:325)
Collapse Failed ThresholdingVisitorIT testBug5258 History
Integration Test < 1 sec
java.lang.AssertionError: Anticipated event count (3) is different from received event count (1).
	at org.junit.Assert.fail(Assert.java:88)
	at org.opennms.netmgt.threshd.ThresholdingVisitorIT.verifyEvents(ThresholdingVisitorIT.java:1943)
	at org.opennms.netmgt.threshd.ThresholdingVisitorIT.testBug5258(ThresholdingVisitorIT.java:1350)
Collapse Failed ThresholdingVisitorIT testBug3194_32bits History
Integration Test < 1 sec
java.lang.AssertionError: Anticipated event count (1) is different from received event count (0).
	at org.junit.Assert.fail(Assert.java:88)
	at org.opennms.netmgt.threshd.ThresholdingVisitorIT.verifyEvents(ThresholdingVisitorIT.java:1943)
	at org.opennms.netmgt.threshd.ThresholdingVisitorIT.runCounterWrapTest(ThresholdingVisitorIT.java:1783)
	at org.opennms.netmgt.threshd.ThresholdingVisitorIT.testBug3194_32bits(ThresholdingVisitorIT.java:949)
Collapse Failed ThresholdingVisitorIT testBug3193 History
Integration Test < 1 sec
java.lang.AssertionError: Anticipated event count (4) is different from received event count (0).
	at org.junit.Assert.fail(Assert.java:88)
	at org.opennms.netmgt.threshd.ThresholdingVisitorIT.verifyEvents(ThresholdingVisitorIT.java:1943)
	at org.opennms.netmgt.threshd.ThresholdingVisitorIT.testBug3193(ThresholdingVisitorIT.java:885)
Collapse Failed ThresholdingVisitorIT testTriggersGenericResource History
Integration Test < 1 sec
java.lang.AssertionError: Anticipated event count (1) is different from received event count (0).
	at org.junit.Assert.fail(Assert.java:88)
	at org.opennms.netmgt.threshd.ThresholdingVisitorIT.verifyEvents(ThresholdingVisitorIT.java:1943)
	at org.opennms.netmgt.threshd.ThresholdingVisitorIT.testTriggersGenericResource(ThresholdingVisitorIT.java:352)
Collapse Failed ThresholdingVisitorIT testResourceCounterData History
Integration Test < 1 sec
java.lang.AssertionError: Anticipated event count (2) is different from received event count (0).
	at org.junit.Assert.fail(Assert.java:88)
	at org.opennms.netmgt.threshd.ThresholdingVisitorIT.verifyEvents(ThresholdingVisitorIT.java:1943)
	at org.opennms.netmgt.threshd.ThresholdingVisitorIT.testResourceCounterData(ThresholdingVisitorIT.java:399)
Collapse Failed ThresholdingVisitorIT testThresholdFiltersOnGenericResourceWithSiblingColumnStorageStrategy History
Integration Test < 1 sec
java.lang.AssertionError: Anticipated event count (1) is different from received event count (0).
	at org.junit.Assert.fail(Assert.java:88)
	at org.opennms.netmgt.threshd.ThresholdingVisitorIT.verifyEvents(ThresholdingVisitorIT.java:1943)
	at org.opennms.netmgt.threshd.ThresholdingVisitorIT.testThresholdFiltersOnGenericResourceWithSiblingColumnStorageStrategy(ThresholdingVisitorIT.java:1654)
Collapse Failed ThresholdingVisitorIT testNMS5115 History
Integration Test < 1 sec
java.lang.AssertionError: Anticipated event count (1) is different from received event count (0).
	at org.junit.Assert.fail(Assert.java:88)
	at org.opennms.netmgt.threshd.ThresholdingVisitorIT.verifyEvents(ThresholdingVisitorIT.java:1943)
	at org.opennms.netmgt.threshd.ThresholdingVisitorIT.testNMS5115(ThresholdingVisitorIT.java:1124)
Collapse Failed ThresholdingVisitorIT testNumericThresholdFiltersOnGenericResource History
Integration Test < 1 sec
java.lang.AssertionError: Anticipated event count (1) is different from received event count (0).
	at org.junit.Assert.fail(Assert.java:88)
	at org.opennms.netmgt.threshd.ThresholdingVisitorIT.verifyEvents(ThresholdingVisitorIT.java:1943)
	at org.opennms.netmgt.threshd.ThresholdingVisitorIT.testNumericThresholdFiltersOnGenericResource(ThresholdingVisitorIT.java:1487)
Collapse Failed ThresholdingVisitorIT testBug3146_reduceTrigger History
Integration Test < 1 sec
java.lang.AssertionError: Anticipated event count (4) is different from received event count (1).
	at org.junit.Assert.fail(Assert.java:88)
	at org.opennms.netmgt.threshd.ThresholdingVisitorIT.verifyEvents(ThresholdingVisitorIT.java:1943)
	at org.opennms.netmgt.threshd.ThresholdingVisitorIT.testBug3146_reduceTrigger(ThresholdingVisitorIT.java:754)
Collapse Failed ThresholdingVisitorIT testThresholdsFiltersOnNodeResource History
Integration Test < 1 sec
java.lang.AssertionError: Anticipated event count (2) is different from received event count (0).
	at org.junit.Assert.fail(Assert.java:88)
	at org.opennms.netmgt.threshd.ThresholdingVisitorIT.verifyEvents(ThresholdingVisitorIT.java:1943)
	at org.opennms.netmgt.threshd.ThresholdingVisitorIT.testThresholdsFiltersOnNodeResource(ThresholdingVisitorIT.java:1528)
Collapse Failed ThresholdingVisitorIT testBug3748 History
Integration Test < 1 sec
java.lang.AssertionError: Anticipated event count (1) is different from received event count (0).
	at org.junit.Assert.fail(Assert.java:88)
	at org.opennms.netmgt.threshd.ThresholdingVisitorIT.verifyEvents(ThresholdingVisitorIT.java:1943)
	at org.opennms.netmgt.threshd.ThresholdingVisitorIT.testBug3748(ThresholdingVisitorIT.java:1098)
Collapse Failed ThresholdingVisitorIT testInterfaceResourceWithDBAttributeFilter History
Integration Test < 1 sec
java.lang.AssertionError: Anticipated event count (2) is different from received event count (0).
	at org.junit.Assert.fail(Assert.java:88)
	at org.opennms.netmgt.threshd.ThresholdingVisitorIT.verifyEvents(ThresholdingVisitorIT.java:1943)
	at org.opennms.netmgt.threshd.ThresholdingVisitorIT.testInterfaceResourceWithDBAttributeFilter(ThresholdingVisitorIT.java:469)
Collapse Failed ThresholdingVisitorIT testBug3146_replaceThreshold History
Integration Test < 1 sec
java.lang.AssertionError: Anticipated event count (3) is different from received event count (1).
	at org.junit.Assert.fail(Assert.java:88)
	at org.opennms.netmgt.threshd.ThresholdingVisitorIT.verifyEvents(ThresholdingVisitorIT.java:1943)
	at org.opennms.netmgt.threshd.ThresholdingVisitorIT.testBug3146_replaceThreshold(ThresholdingVisitorIT.java:833)
Collapse Failed ThresholdingVisitorIT testZeroIntervalResourceCounterData History
Integration Test < 1 sec
java.lang.AssertionError: Anticipated event count (2) is different from received event count (0).
	at org.junit.Assert.fail(Assert.java:88)
	at org.opennms.netmgt.threshd.ThresholdingVisitorIT.verifyEvents(ThresholdingVisitorIT.java:1943)
	at org.opennms.netmgt.threshd.ThresholdingVisitorIT.testZeroIntervalResourceCounterData(ThresholdingVisitorIT.java:448)
Collapse Failed ThresholdingVisitorIT testBug3664 History
Integration Test < 1 sec
java.lang.AssertionError: Anticipated event count (2) is different from received event count (0).
	at org.junit.Assert.fail(Assert.java:88)
	at org.opennms.netmgt.threshd.ThresholdingVisitorIT.verifyEvents(ThresholdingVisitorIT.java:1943)
	at org.opennms.netmgt.threshd.ThresholdingVisitorIT.testBug3664(ThresholdingVisitorIT.java:1305)
Collapse Failed ThresholdingVisitorIT testThresholdsFiltersOnNodeResourceWithCollectionSetBuilder History
Integration Test < 1 sec
java.lang.AssertionError: Anticipated event count (2) is different from received event count (0).
	at org.junit.Assert.fail(Assert.java:88)
	at org.opennms.netmgt.threshd.ThresholdingVisitorIT.verifyEvents(ThresholdingVisitorIT.java:1943)
	at org.opennms.netmgt.threshd.ThresholdingVisitorIT.testThresholdsFiltersOnNodeResourceWithCollectionSetBuilder(ThresholdingVisitorIT.java:1566)
Collapse Failed ThresholdingVisitorIT testBug2711_noIpAddress History
Integration Test < 1 sec
java.lang.AssertionError: Anticipated event count (2) is different from received event count (0).
	at org.junit.Assert.fail(Assert.java:88)
	at org.opennms.netmgt.threshd.ThresholdingVisitorIT.verifyEvents(ThresholdingVisitorIT.java:1943)
	at org.opennms.netmgt.threshd.ThresholdingVisitorIT.runTestForBug2711(ThresholdingVisitorIT.java:1138)
	at org.opennms.netmgt.threshd.ThresholdingVisitorIT.testBug2711_noIpAddress(ThresholdingVisitorIT.java:897)
Collapse Failed ThresholdingVisitorIT testBug3428_match History
Integration Test < 1 sec
java.lang.AssertionError: Anticipated event count (1) is different from received event count (0).
	at org.junit.Assert.fail(Assert.java:88)
	at org.opennms.netmgt.threshd.ThresholdingVisitorIT.verifyEvents(ThresholdingVisitorIT.java:1943)
	at org.opennms.netmgt.threshd.ThresholdingVisitorIT.testBug3428_match(ThresholdingVisitorIT.java:1254)
Collapse Failed ThresholdingVisitorIT testBug3194_64bits History
Integration Test < 1 sec
java.lang.AssertionError: Anticipated event count (1) is different from received event count (0).
	at org.junit.Assert.fail(Assert.java:88)
	at org.opennms.netmgt.threshd.ThresholdingVisitorIT.verifyEvents(ThresholdingVisitorIT.java:1943)
	at org.opennms.netmgt.threshd.ThresholdingVisitorIT.runCounterWrapTest(ThresholdingVisitorIT.java:1783)
	at org.opennms.netmgt.threshd.ThresholdingVisitorIT.testBug3194_64bits(ThresholdingVisitorIT.java:957)
Collapse Failed ThresholdingVisitorIT testBug3146_unrelatedChange History
Integration Test < 1 sec
java.lang.AssertionError: Anticipated event count (2) is different from received event count (0).
	at org.junit.Assert.fail(Assert.java:88)
	at org.opennms.netmgt.threshd.ThresholdingVisitorIT.verifyEvents(ThresholdingVisitorIT.java:1943)
	at org.opennms.netmgt.threshd.ThresholdingVisitorIT.testBug3146_unrelatedChange(ThresholdingVisitorIT.java:716)
Collapse Failed ThresholdingVisitorIT testThresholdFiltersOnGenericResource History
Integration Test < 1 sec
java.lang.AssertionError: Anticipated event count (2) is different from received event count (0).
	at org.junit.Assert.fail(Assert.java:88)
	at org.opennms.netmgt.threshd.ThresholdingVisitorIT.verifyEvents(ThresholdingVisitorIT.java:1943)
	at org.opennms.netmgt.threshd.ThresholdingVisitorIT.testThresholdFiltersOnGenericResource(ThresholdingVisitorIT.java:1468)
Collapse Failed ThresholdingVisitorIT testThresholdFiltersOnGenericResourceWithCollectionSetBuilder History
Integration Test < 1 sec
java.lang.AssertionError: Anticipated event count (2) is different from received event count (0).
	at org.junit.Assert.fail(Assert.java:88)
	at org.opennms.netmgt.threshd.ThresholdingVisitorIT.verifyEvents(ThresholdingVisitorIT.java:1943)
	at org.opennms.netmgt.threshd.ThresholdingVisitorIT.testThresholdFiltersOnGenericResourceWithCollectionSetBuilder(ThresholdingVisitorIT.java:1586)
Collapse Failed ThresholdingVisitorIT testBug3146_inceaseTrigger History
Integration Test < 1 sec
java.lang.AssertionError: Anticipated event count (2) is different from received event count (1).
	at org.junit.Assert.fail(Assert.java:88)
	at org.opennms.netmgt.threshd.ThresholdingVisitorIT.verifyEvents(ThresholdingVisitorIT.java:1943)
	at org.opennms.netmgt.threshd.ThresholdingVisitorIT.testBug3146_inceaseTrigger(ThresholdingVisitorIT.java:782)

Jira issues

IssueDescriptionStatus
16 more issues…
Unknown Issue TypeHZN-1307Could not obtain issue details from Jira
Unknown Issue TypeHZN-1331Could not obtain issue details from Jira
Unknown Issue TypeHZN-1338Could not obtain issue details from Jira
Unknown Issue TypeHZN-1343Could not obtain issue details from Jira
Unknown Issue TypeHZN-1359Could not obtain issue details from Jira