Build #1

Build: #1 failed First build for this plan

Build result summary

Details

Completed
Duration
531 minutes
Labels
None
Revisions
OpenNMS (develop branch)
5f65348d28c241bc4d9c57c537d7b3a16e246d03 5f65348d28c241bc4d9c57c537d7b3a16e246d03
OpenNMS Installer
da12784d9ab4ba4aacedec0283d0c04075fd6ebf da12784d9ab4ba4aacedec0283d0c04075fd6ebf
OpenNMS-Repo
088d710674109759251f42c6720d74ea80cf3f13 088d710674109759251f42c6720d74ea80cf3f13
Smoke Tests
cb1e72265cf2ce10cb4872f58120272b340a1ce1 cb1e72265cf2ce10cb4872f58120272b340a1ce1
OpenNMS Bamboo Utils
0a62053bc90f6ffcce1e17256674b2dae7b4f8a3 0a62053bc90f6ffcce1e17256674b2dae7b4f8a3
OpenNMS System Test API
2f3a985377db43ce9b451390b9744bac402ffbd7 2f3a985377db43ce9b451390b9744bac402ffbd7
Total tests
4887
Fixed in
#5 (Changes by Markus von Rüden)

Tests

Responsible

No one has taken responsibility for this failure

Tests

New test failures 4
Status Test View job Duration
Collapse Failed DefaultGraphRepositoryIT verifyCRUD History
Integration Test < 1 sec
java.lang.IllegalStateException: Failed to load ApplicationContext
	at org.springframework.test.context.cache.DefaultCacheAwareContextLoaderDelegate.loadContext(DefaultCacheAwareContextLoaderDelegate.java:124)
	at org.springframework.test.context.support.DefaultTestContext.getApplicationContext(DefaultTestContext.java:83)
	at org.springframework.test.context.support.DependencyInjectionTestExecutionListener.injectDependencies(DependencyInjectionTestExecutionListener.java:117)
	at org.springframework.test.context.support.DependencyInjectionTestExecutionListener.prepareTestInstance(DependencyInjectionTestExecutionListener.java:83)
	at org.springframework.test.context.TestContextManager.prepareTestInstance(TestContextManager.java:228)
	at org.springframework.test.context.junit4.SpringJUnit4ClassRunner.createTest(SpringJUnit4ClassRunner.java:230)
	at org.springframework.test.context.junit4.SpringJUnit4ClassRunner$1.runReflectiveCall(SpringJUnit4ClassRunner.java:289)
(66 more lines...)
Collapse Failed GraphMLGraphProviderIT canExposeGraphML History
Smoke Test 5 mins
com.jayway.awaitility.core.ConditionTimeoutException: Condition with lambda expression in org.opennms.smoketest.utils.KarafShell was not fulfilled within 5 minutes.
	at org.opennms.smoketest.graph.GraphMLGraphProviderIT.canExposeGraphML(GraphMLGraphProviderIT.java:91)
Collapse Failed GraphProviderIT canImportGraphRepository History
Smoke Test 5 mins
com.jayway.awaitility.core.ConditionTimeoutException: Condition with lambda expression in org.opennms.smoketest.utils.KarafShell was not fulfilled within 5 minutes.
	at org.opennms.smoketest.graph.GraphProviderIT.canImportGraphRepository(GraphProviderIT.java:72)
Collapse Failed GraphProviderIT canExposeGraphProvider History
Smoke Test 6 mins
com.jayway.awaitility.core.ConditionTimeoutException: Condition with lambda expression in org.opennms.smoketest.utils.KarafShell was not fulfilled within 5 minutes.
	at org.opennms.smoketest.graph.GraphProviderIT.canExposeGraphProvider(GraphProviderIT.java:61)