Build #4

Build: #4 failed Changes by Chandra Gorantla <chandra@opennms.com>

Build result summary

Details

Completed
Duration
1500 minutes
Labels
None
Revisions
OpenNMS (develop branch)
77d5fff5531117bf75fa7502ffba6d8e50b44a7d 77d5fff5531117bf75fa7502ffba6d8e50b44a7d
OpenNMS Installer
da12784d9ab4ba4aacedec0283d0c04075fd6ebf da12784d9ab4ba4aacedec0283d0c04075fd6ebf
OpenNMS-Repo
088d710674109759251f42c6720d74ea80cf3f13 088d710674109759251f42c6720d74ea80cf3f13
Smoke Tests
cb1e72265cf2ce10cb4872f58120272b340a1ce1 cb1e72265cf2ce10cb4872f58120272b340a1ce1
OpenNMS Bamboo Utils
0a62053bc90f6ffcce1e17256674b2dae7b4f8a3 0a62053bc90f6ffcce1e17256674b2dae7b4f8a3
OpenNMS System Test API
2f3a985377db43ce9b451390b9744bac402ffbd7 2f3a985377db43ce9b451390b9744bac402ffbd7
Total tests
7811
Failing since
#1 (First build for this plan – )

Responsible

This build has been failing since #1
No one has taken responsibility

Code commits

OpenNMS (develop branch)
Author Commit Message Commit date
Chandra Gorantla <chandra@opennms.com> Chandra Gorantla <chandra@opennms.com> 77d5fff5531117bf75fa7502ffba6d8e50b44a7d 77d5fff5531117bf75fa7502ffba6d8e50b44a7d Merge remote-tracking branch 'kafkaUpgrade/jira/NMS-10624' into jira/NMS-10624
Naicisum <Naicisum@users.noreply.github.com> Naicisum <Naicisum@users.noreply.github.com> 067c9ed7fc49966000eef7cd4bcaa7211b912458 m 067c9ed7fc49966000eef7cd4bcaa7211b912458 NMS-10624: Update maven dependency configuration
Naicisum <Naicisum@users.noreply.github.com> Naicisum <Naicisum@users.noreply.github.com> a674d4489a11a0be085fe091c99e2839ad803542 m a674d4489a11a0be085fe091c99e2839ad803542 NMS-10624: Upgrade kafka components and dependencies to 2.2.0
Naicisum <Naicisum@users.noreply.github.com> Naicisum <Naicisum@users.noreply.github.com> 7521840790f6bc9749dd358b92f084da14c56fc5 m 7521840790f6bc9749dd358b92f084da14c56fc5 NMS-10624: Upgrade kafka components to 2.1.1
Benjamin Reed Benjamin Reed 007a68655d57fdc82534245803a7d9fd01674668 m 007a68655d57fdc82534245803a7d9fd01674668 Merge remote-tracking branch 'origin/release-24.0.0' into develop

Tests

New test failures 78
Status Test View job Duration
Collapse Failed AboutPageIT org.opennms.smoketest.AboutPageIT History
Smoke Test 5 mins
com.jayway.awaitility.core.ConditionTimeoutException: org.opennms.test.system.api.NewTestEnvironment.waitForOpenNMS Callable expected not null but was <null> within 5 minutes.
Collapse Failed AdminDataCollectionSnmpInterfacesIT org.opennms.smoketest.AdminDataCollectionSnmpInterfacesIT History
Smoke Test 5 mins
com.jayway.awaitility.core.ConditionTimeoutException: org.opennms.test.system.api.NewTestEnvironment.waitForOpenNMS Callable expected not null but was <null> within 5 minutes.
Collapse Failed AdminPageIT org.opennms.smoketest.AdminPageIT History
Smoke Test 5 mins
com.jayway.awaitility.core.ConditionTimeoutException: org.opennms.test.system.api.NewTestEnvironment.waitForOpenNMS Callable expected not null but was <null> within 5 minutes.
Collapse Failed AdminSnmpConfigForIpPageIT org.opennms.smoketest.AdminSnmpConfigForIpPageIT History
Smoke Test 5 mins
com.jayway.awaitility.core.ConditionTimeoutException: org.opennms.test.system.api.NewTestEnvironment.waitForOpenNMS Callable expected not null but was <null> within 5 minutes.
Collapse Failed AlarmElasticsearch5IT org.opennms.smoketest.AlarmElasticsearch5IT History
Smoke Test 5 mins
com.jayway.awaitility.core.ConditionTimeoutException: org.opennms.test.system.api.NewTestEnvironment.waitForOpenNMS Callable expected not null but was <null> within 5 minutes.
Collapse Failed AlarmsPageIT org.opennms.smoketest.AlarmsPageIT History
Smoke Test 5 mins
com.jayway.awaitility.core.ConditionTimeoutException: org.opennms.test.system.api.NewTestEnvironment.waitForOpenNMS Callable expected not null but was <null> within 5 minutes.
Collapse Failed AssetsPageForNodeIT org.opennms.smoketest.AssetsPageForNodeIT History
Smoke Test 5 mins
com.jayway.awaitility.core.ConditionTimeoutException: org.opennms.test.system.api.NewTestEnvironment.waitForOpenNMS Callable expected not null but was <null> within 5 minutes.
Collapse Failed AssetsPageIT org.opennms.smoketest.AssetsPageIT History
Smoke Test 5 mins
com.jayway.awaitility.core.ConditionTimeoutException: org.opennms.test.system.api.NewTestEnvironment.waitForOpenNMS Callable expected not null but was <null> within 5 minutes.
Collapse Failed CategoriesBoxIT org.opennms.smoketest.CategoriesBoxIT History
Smoke Test 5 mins
com.jayway.awaitility.core.ConditionTimeoutException: org.opennms.test.system.api.NewTestEnvironment.waitForOpenNMS Callable expected not null but was <null> within 5 minutes.
Collapse Failed ChooseResourcesPageIT org.opennms.smoketest.ChooseResourcesPageIT History
Smoke Test 5 mins
com.jayway.awaitility.core.ConditionTimeoutException: org.opennms.test.system.api.NewTestEnvironment.waitForOpenNMS Callable expected not null but was <null> within 5 minutes.
Collapse Failed ClassificationRulePageIT org.opennms.smoketest.ClassificationRulePageIT History
Smoke Test 5 mins
com.jayway.awaitility.core.ConditionTimeoutException: org.opennms.test.system.api.NewTestEnvironment.waitForOpenNMS Callable expected not null but was <null> within 5 minutes.
Collapse Failed DatabaseReportBatchIT org.opennms.smoketest.DatabaseReportBatchIT History
Smoke Test 5 mins
com.jayway.awaitility.core.ConditionTimeoutException: org.opennms.test.system.api.NewTestEnvironment.waitForOpenNMS Callable expected not null but was <null> within 5 minutes.
Collapse Failed DatabaseReportIT org.opennms.smoketest.DatabaseReportIT History
Smoke Test 5 mins
com.jayway.awaitility.core.ConditionTimeoutException: org.opennms.test.system.api.NewTestEnvironment.waitForOpenNMS Callable expected not null but was <null> within 5 minutes.
Collapse Failed EditInRequisitionIT org.opennms.smoketest.EditInRequisitionIT History
Smoke Test 5 mins
com.jayway.awaitility.core.ConditionTimeoutException: org.opennms.test.system.api.NewTestEnvironment.waitForOpenNMS Callable expected not null but was <null> within 5 minutes.
Collapse Failed ErrorResponseIT org.opennms.smoketest.ErrorResponseIT History
Smoke Test 5 mins
com.jayway.awaitility.core.ConditionTimeoutException: org.opennms.test.system.api.NewTestEnvironment.waitForOpenNMS Callable expected not null but was <null> within 5 minutes.
Collapse Failed EventSinkIT org.opennms.smoketest.EventSinkIT History
Smoke Test 5 mins
com.jayway.awaitility.core.ConditionTimeoutException: org.opennms.test.system.api.NewTestEnvironment.waitForOpenNMS Callable expected not null but was <null> within 5 minutes.
Collapse Failed EventsPageIT org.opennms.smoketest.EventsPageIT History
Smoke Test 5 mins
com.jayway.awaitility.core.ConditionTimeoutException: org.opennms.test.system.api.NewTestEnvironment.waitForOpenNMS Callable expected not null but was <null> within 5 minutes.
Collapse Failed ClassificationRestIT org.opennms.smoketest.flow.ClassificationRestIT History
Smoke Test 5 mins
com.jayway.awaitility.core.ConditionTimeoutException: org.opennms.test.system.api.NewTestEnvironment.waitForOpenNMS Callable expected not null but was <null> within 5 minutes.
Collapse Failed FlowStackIT verifyFlowStack History
Smoke Test 5 mins
com.jayway.awaitility.core.ConditionTimeoutException: org.opennms.test.system.api.NewTestEnvironment.waitForOpenNMS Callable expected not null but was <null> within 5 minutes.
Collapse Failed SinglePortFlowsIT verifyFlowStack History
Smoke Test 5 mins
com.jayway.awaitility.core.ConditionTimeoutException: org.opennms.test.system.api.NewTestEnvironment.waitForOpenNMS Callable expected not null but was <null> within 5 minutes.
Collapse Failed FooterIT org.opennms.smoketest.FooterIT History
Smoke Test 5 mins
com.jayway.awaitility.core.ConditionTimeoutException: org.opennms.test.system.api.NewTestEnvironment.waitForOpenNMS Callable expected not null but was <null> within 5 minutes.
Collapse Failed ForecastIT org.opennms.smoketest.ForecastIT History
Smoke Test 5 mins
com.jayway.awaitility.core.ConditionTimeoutException: org.opennms.test.system.api.NewTestEnvironment.waitForOpenNMS Callable expected not null but was <null> within 5 minutes.
Collapse Failed HealthCheckIT org.opennms.smoketest.health.HealthCheckIT History
Smoke Test 5 mins
com.jayway.awaitility.core.ConditionTimeoutException: org.opennms.test.system.api.NewTestEnvironment.waitForOpenNMS Callable expected not null but was <null> within 5 minutes.
Collapse Failed HelpPageIT org.opennms.smoketest.HelpPageIT History
Smoke Test 5 mins
com.jayway.awaitility.core.ConditionTimeoutException: org.opennms.test.system.api.NewTestEnvironment.waitForOpenNMS Callable expected not null but was <null> within 5 minutes.
Collapse Failed IndexPageIT org.opennms.smoketest.IndexPageIT History
Smoke Test 5 mins
com.jayway.awaitility.core.ConditionTimeoutException: org.opennms.test.system.api.NewTestEnvironment.waitForOpenNMS Callable expected not null but was <null> within 5 minutes.
Collapse Failed InstrumentationLogReaderPageIT org.opennms.smoketest.InstrumentationLogReaderPageIT History
Smoke Test 5 mins
com.jayway.awaitility.core.ConditionTimeoutException: org.opennms.test.system.api.NewTestEnvironment.waitForOpenNMS Callable expected not null but was <null> within 5 minutes.
Collapse Failed IntegrationAPIIT org.opennms.smoketest.IntegrationAPIIT History
Smoke Test 5 mins
com.jayway.awaitility.core.ConditionTimeoutException: org.opennms.test.system.api.NewTestEnvironment.waitForOpenNMS Callable expected not null but was <null> within 5 minutes.
Collapse Failed InterfacesOnNodePageIT org.opennms.smoketest.InterfacesOnNodePageIT History
Smoke Test 5 mins
com.jayway.awaitility.core.ConditionTimeoutException: org.opennms.test.system.api.NewTestEnvironment.waitForOpenNMS Callable expected not null but was <null> within 5 minutes.
Collapse Failed JmxConfigurationGeneratorIT org.opennms.smoketest.JmxConfigurationGeneratorIT History
Smoke Test 5 mins
com.jayway.awaitility.core.ConditionTimeoutException: org.opennms.test.system.api.NewTestEnvironment.waitForOpenNMS Callable expected not null but was <null> within 5 minutes.
Collapse Failed KafkaPersisterIT org.opennms.smoketest.KafkaPersisterIT History
Smoke Test 5 mins
com.jayway.awaitility.core.ConditionTimeoutException: org.opennms.test.system.api.NewTestEnvironment.waitForOpenNMS Callable expected not null but was <null> within 5 minutes.
Collapse Failed KafkaProducerIT org.opennms.smoketest.KafkaProducerIT History
Smoke Test 5 mins
com.jayway.awaitility.core.ConditionTimeoutException: org.opennms.test.system.api.NewTestEnvironment.waitForOpenNMS Callable expected not null but was <null> within 5 minutes.
Collapse Failed KSCEditorIT org.opennms.smoketest.KSCEditorIT History
Smoke Test 5 mins
com.jayway.awaitility.core.ConditionTimeoutException: org.opennms.test.system.api.NewTestEnvironment.waitForOpenNMS Callable expected not null but was <null> within 5 minutes.
Collapse Failed MenuHeaderIT org.opennms.smoketest.MenuHeaderIT History
Smoke Test 5 mins
com.jayway.awaitility.core.ConditionTimeoutException: org.opennms.test.system.api.NewTestEnvironment.waitForOpenNMS Callable expected not null but was <null> within 5 minutes.
Collapse Failed MetadataPageIT org.opennms.smoketest.MetadataPageIT History
Smoke Test 5 mins
com.jayway.awaitility.core.ConditionTimeoutException: org.opennms.test.system.api.NewTestEnvironment.waitForOpenNMS Callable expected not null but was <null> within 5 minutes.
Collapse Failed CollectorListIT org.opennms.smoketest.minion.CollectorListIT History
Smoke Test 5 mins
com.jayway.awaitility.core.ConditionTimeoutException: org.opennms.test.system.api.NewTestEnvironment.waitForOpenNMS Callable expected not null but was <null> within 5 minutes.
Collapse Failed DetectorsCommandIT org.opennms.smoketest.minion.DetectorsCommandIT History
Smoke Test 5 mins
com.jayway.awaitility.core.ConditionTimeoutException: org.opennms.test.system.api.NewTestEnvironment.waitForOpenNMS Callable expected not null but was <null> within 5 minutes.
Collapse Failed DetectorsOnMinionIT org.opennms.smoketest.minion.DetectorsOnMinionIT History
Smoke Test 5 mins
com.jayway.awaitility.core.ConditionTimeoutException: org.opennms.test.system.api.NewTestEnvironment.waitForOpenNMS Callable expected not null but was <null> within 5 minutes.
Collapse Failed DiscoveryIT org.opennms.smoketest.minion.DiscoveryIT History
Smoke Test 5 mins
com.jayway.awaitility.core.ConditionTimeoutException: org.opennms.test.system.api.NewTestEnvironment.waitForOpenNMS Callable expected not null but was <null> within 5 minutes.
Collapse Failed JMXCollectorIT org.opennms.smoketest.minion.JMXCollectorIT History
Smoke Test 5 mins
com.jayway.awaitility.core.ConditionTimeoutException: org.opennms.test.system.api.NewTestEnvironment.waitForOpenNMS Callable expected not null but was <null> within 5 minutes.
Collapse Failed JtiTelemetryIT org.opennms.smoketest.minion.JtiTelemetryIT History
Smoke Test 5 mins
com.jayway.awaitility.core.ConditionTimeoutException: org.opennms.test.system.api.NewTestEnvironment.waitForOpenNMS Callable expected not null but was <null> within 5 minutes.
Collapse Failed MinionHeartBeatIT org.opennms.smoketest.minion.MinionHeartBeatIT History
Smoke Test 5 mins
com.jayway.awaitility.core.ConditionTimeoutException: org.opennms.test.system.api.NewTestEnvironment.waitForOpenNMS Callable expected not null but was <null> within 5 minutes.
Collapse Failed MinionHeartbeatOutageIT testHeartbeatOutages History
Smoke Test 5 mins
com.jayway.awaitility.core.ConditionTimeoutException: org.opennms.test.system.api.NewTestEnvironment.waitForOpenNMS Callable expected not null but was <null> within 5 minutes.
Collapse Failed MonitorsListCommandIT org.opennms.smoketest.minion.MonitorsListCommandIT History
Smoke Test 5 mins
com.jayway.awaitility.core.ConditionTimeoutException: org.opennms.test.system.api.NewTestEnvironment.waitForOpenNMS Callable expected not null but was <null> within 5 minutes.
Collapse Failed NxosTelemetryIT org.opennms.smoketest.minion.NxosTelemetryIT History
Smoke Test 5 mins
com.jayway.awaitility.core.ConditionTimeoutException: org.opennms.test.system.api.NewTestEnvironment.waitForOpenNMS Callable expected not null but was <null> within 5 minutes.
Collapse Failed TrapIT org.opennms.smoketest.minion.TrapIT History
Smoke Test 5 mins
com.jayway.awaitility.core.ConditionTimeoutException: org.opennms.test.system.api.NewTestEnvironment.waitForOpenNMS Callable expected not null but was <null> within 5 minutes.
Collapse Failed NodeDetailPageIT org.opennms.smoketest.NodeDetailPageIT History
Smoke Test 5 mins
com.jayway.awaitility.core.ConditionTimeoutException: org.opennms.test.system.api.NewTestEnvironment.waitForOpenNMS Callable expected not null but was <null> within 5 minutes.
Collapse Failed NodeListPageIT org.opennms.smoketest.NodeListPageIT History
Smoke Test 5 mins
com.jayway.awaitility.core.ConditionTimeoutException: org.opennms.test.system.api.NewTestEnvironment.waitForOpenNMS Callable expected not null but was <null> within 5 minutes.
Collapse Failed NodeRestIT org.opennms.smoketest.NodeRestIT History
Smoke Test 5 mins
com.jayway.awaitility.core.ConditionTimeoutException: org.opennms.test.system.api.NewTestEnvironment.waitForOpenNMS Callable expected not null but was <null> within 5 minutes.
Collapse Failed NotifdIT org.opennms.smoketest.NotifdIT History
Smoke Test 5 mins
com.jayway.awaitility.core.ConditionTimeoutException: org.opennms.test.system.api.NewTestEnvironment.waitForOpenNMS Callable expected not null but was <null> within 5 minutes.
Collapse Failed NotificationsPageIT org.opennms.smoketest.NotificationsPageIT History
Smoke Test 5 mins
com.jayway.awaitility.core.ConditionTimeoutException: org.opennms.test.system.api.NewTestEnvironment.waitForOpenNMS Callable expected not null but was <null> within 5 minutes.
Existing test failures 10
Status Test Failing since View job Duration
com.jayway.awaitility.core.ConditionTimeoutException: org.opennms.test.system.api.NewTestEnvironment.waitForOpenNMS Callable expected not null but was <null> within 5 minutes.
com.jayway.awaitility.core.ConditionTimeoutException: org.opennms.test.system.api.NewTestEnvironment.waitForOpenNMS Callable expected not null but was <null> within 5 minutes.
com.jayway.awaitility.core.ConditionTimeoutException: org.opennms.test.system.api.NewTestEnvironment.waitForOpenNMS Callable expected not null but was <null> within 5 minutes.
com.jayway.awaitility.core.ConditionTimeoutException: org.opennms.test.system.api.NewTestEnvironment.waitForOpenNMS Callable expected not null but was <null> within 5 minutes.
com.jayway.awaitility.core.ConditionTimeoutException: org.opennms.test.system.api.NewTestEnvironment.waitForOpenNMS Callable expected not null but was <null> within 5 minutes.
com.jayway.awaitility.core.ConditionTimeoutException: org.opennms.test.system.api.NewTestEnvironment.waitForOpenNMS Callable expected not null but was <null> within 5 minutes.
com.jayway.awaitility.core.ConditionTimeoutException: org.opennms.test.system.api.NewTestEnvironment.waitForOpenNMS Callable expected not null but was <null> within 5 minutes.
com.jayway.awaitility.core.ConditionTimeoutException: org.opennms.test.system.api.NewTestEnvironment.waitForOpenNMS Callable expected not null but was <null> within 5 minutes.
com.jayway.awaitility.core.ConditionTimeoutException: org.opennms.test.system.api.NewTestEnvironment.waitForOpenNMS Callable expected not null but was <null> within 5 minutes.
com.jayway.awaitility.core.ConditionTimeoutException: org.opennms.test.system.api.NewTestEnvironment.waitForOpenNMS Callable expected not null but was <null> within 5 minutes.

Jira issues

IssueDescriptionStatus
14 more issues…
Unknown Issue TypeHZN-1495Could not obtain issue details from Jira
Unknown Issue TypeHZN-1500Could not obtain issue details from Jira
Unknown Issue TypeHZN-1504Could not obtain issue details from Jira
Unknown Issue TypeHZN-1506Could not obtain issue details from Jira
Unknown Issue TypeHZN-1512Could not obtain issue details from Jira