Build #1

Build: #1 failed First build for this plan

Build result summary

Details

Completed
Duration
1432 minutes
Labels
None
Revisions
OpenNMS (develop branch)
c5e789a4ce559c6489b74d3f1e687d1b67951c6d c5e789a4ce559c6489b74d3f1e687d1b67951c6d
OpenNMS Installer
da12784d9ab4ba4aacedec0283d0c04075fd6ebf da12784d9ab4ba4aacedec0283d0c04075fd6ebf
OpenNMS-Repo
088d710674109759251f42c6720d74ea80cf3f13 088d710674109759251f42c6720d74ea80cf3f13
Smoke Tests
cb1e72265cf2ce10cb4872f58120272b340a1ce1 cb1e72265cf2ce10cb4872f58120272b340a1ce1
OpenNMS Bamboo Utils
0a62053bc90f6ffcce1e17256674b2dae7b4f8a3 0a62053bc90f6ffcce1e17256674b2dae7b4f8a3
OpenNMS System Test API
2f3a985377db43ce9b451390b9744bac402ffbd7 2f3a985377db43ce9b451390b9744bac402ffbd7
Total tests
2344

Tests

Responsible

No one has taken responsibility for this failure

Tests

New test failures 93
Status Test View job Duration
Collapse Failed RpcKafkaIT testLargeMessages History
Integration Test 1 sec
java.lang.NoClassDefFoundError: Could not initialize class kafka.utils.Log4jControllerRegistration$
	at kafka.utils.Logging$class.$init$(Logging.scala:47)
	at kafka.server.DynamicBrokerConfig.<init>(DynamicBrokerConfig.scala:174)
	at kafka.server.KafkaConfig$$anonfun$3.apply(KafkaConfig.scala:1066)
	at kafka.server.KafkaConfig$$anonfun$3.apply(KafkaConfig.scala:1066)
	at scala.Option.getOrElse(Option.scala:121)
	at kafka.server.KafkaConfig.<init>(KafkaConfig.scala:1066)
	at kafka.server.KafkaConfig.<init>(KafkaConfig.scala:1062)
(19 more lines...)
Collapse Failed RpcKafkaIT testExceptionWhileExecutingOnRemoteLocation History
Integration Test 1 sec
java.lang.NoClassDefFoundError: Could not initialize class kafka.utils.Log4jControllerRegistration$
	at kafka.utils.Logging$class.$init$(Logging.scala:47)
	at kafka.server.DynamicBrokerConfig.<init>(DynamicBrokerConfig.scala:174)
	at kafka.server.KafkaConfig$$anonfun$3.apply(KafkaConfig.scala:1066)
	at kafka.server.KafkaConfig$$anonfun$3.apply(KafkaConfig.scala:1066)
	at scala.Option.getOrElse(Option.scala:121)
	at kafka.server.KafkaConfig.<init>(KafkaConfig.scala:1066)
	at kafka.server.KafkaConfig.<init>(KafkaConfig.scala:1062)
(19 more lines...)
Collapse Failed RpcKafkaIT stressTestKafkaRpcWithSystemIdAndTestMinionSingleRequest History
Integration Test 1 sec
java.lang.NoClassDefFoundError: Could not initialize class kafka.utils.Log4jControllerRegistration$
	at kafka.utils.Logging$class.$init$(Logging.scala:47)
	at kafka.server.DynamicBrokerConfig.<init>(DynamicBrokerConfig.scala:174)
	at kafka.server.KafkaConfig$$anonfun$3.apply(KafkaConfig.scala:1066)
	at kafka.server.KafkaConfig$$anonfun$3.apply(KafkaConfig.scala:1066)
	at scala.Option.getOrElse(Option.scala:121)
	at kafka.server.KafkaConfig.<init>(KafkaConfig.scala:1066)
	at kafka.server.KafkaConfig.<init>(KafkaConfig.scala:1062)
(19 more lines...)
Collapse Failed RpcKafkaIT testKafkaRpcAtRemoteLocation History
Integration Test 1 sec
java.lang.NoClassDefFoundError: Could not initialize class kafka.utils.Log4jControllerRegistration$
	at kafka.utils.Logging$class.$init$(Logging.scala:47)
	at kafka.server.DynamicBrokerConfig.<init>(DynamicBrokerConfig.scala:174)
	at kafka.server.KafkaConfig$$anonfun$3.apply(KafkaConfig.scala:1066)
	at kafka.server.KafkaConfig$$anonfun$3.apply(KafkaConfig.scala:1066)
	at scala.Option.getOrElse(Option.scala:121)
	at kafka.server.KafkaConfig.<init>(KafkaConfig.scala:1066)
	at kafka.server.KafkaConfig.<init>(KafkaConfig.scala:1062)
(19 more lines...)
Collapse Failed RpcKafkaIT stressTestKafkaRpcWithDifferentTimeouts History
Integration Test 1 sec
java.lang.NoClassDefFoundError: Could not initialize class kafka.utils.Log4jControllerRegistration$
	at kafka.utils.Logging$class.$init$(Logging.scala:47)
	at kafka.server.DynamicBrokerConfig.<init>(DynamicBrokerConfig.scala:174)
	at kafka.server.KafkaConfig$$anonfun$3.apply(KafkaConfig.scala:1066)
	at kafka.server.KafkaConfig$$anonfun$3.apply(KafkaConfig.scala:1066)
	at scala.Option.getOrElse(Option.scala:121)
	at kafka.server.KafkaConfig.<init>(KafkaConfig.scala:1066)
	at kafka.server.KafkaConfig.<init>(KafkaConfig.scala:1062)
(19 more lines...)
Collapse Failed RpcKafkaIT testLargeMessagesWithSystemId History
Integration Test 1 sec
java.lang.NoClassDefFoundError: Could not initialize class kafka.utils.Log4jControllerRegistration$
	at kafka.utils.Logging$class.$init$(Logging.scala:47)
	at kafka.server.DynamicBrokerConfig.<init>(DynamicBrokerConfig.scala:174)
	at kafka.server.KafkaConfig$$anonfun$3.apply(KafkaConfig.scala:1066)
	at kafka.server.KafkaConfig$$anonfun$3.apply(KafkaConfig.scala:1066)
	at scala.Option.getOrElse(Option.scala:121)
	at kafka.server.KafkaConfig.<init>(KafkaConfig.scala:1066)
	at kafka.server.KafkaConfig.<init>(KafkaConfig.scala:1062)
(19 more lines...)
Collapse Failed RpcKafkaIT testExceptionWhileExecutingLocally History
Integration Test 1 sec
java.lang.NoClassDefFoundError: Could not initialize class kafka.utils.Log4jControllerRegistration$
	at kafka.utils.Logging$class.$init$(Logging.scala:47)
	at kafka.server.DynamicBrokerConfig.<init>(DynamicBrokerConfig.scala:174)
	at kafka.server.KafkaConfig$$anonfun$3.apply(KafkaConfig.scala:1066)
	at kafka.server.KafkaConfig$$anonfun$3.apply(KafkaConfig.scala:1066)
	at scala.Option.getOrElse(Option.scala:121)
	at kafka.server.KafkaConfig.<init>(KafkaConfig.scala:1066)
	at kafka.server.KafkaConfig.<init>(KafkaConfig.scala:1062)
(19 more lines...)
Collapse Failed RpcKafkaIT testKafkaRpcAtDefaultLocation History
Integration Test 1 sec
java.lang.NoClassDefFoundError: com/typesafe/scalalogging/Logger$
	at kafka.utils.Log4jControllerRegistration$.<init>(Logging.scala:25)
	at kafka.utils.Log4jControllerRegistration$.<clinit>(Logging.scala)
	at kafka.utils.Logging$class.$init$(Logging.scala:47)
	at kafka.server.DynamicBrokerConfig.<init>(DynamicBrokerConfig.scala:174)
	at kafka.server.KafkaConfig$$anonfun$3.apply(KafkaConfig.scala:1066)
	at kafka.server.KafkaConfig$$anonfun$3.apply(KafkaConfig.scala:1066)
	at scala.Option.getOrElse(Option.scala:121)
(54 more lines...)
Collapse Failed RpcKafkaIT stressTestKafkaRpc History
Integration Test 1 sec
java.lang.NoClassDefFoundError: Could not initialize class kafka.utils.Log4jControllerRegistration$
	at kafka.utils.Logging$class.$init$(Logging.scala:47)
	at kafka.server.DynamicBrokerConfig.<init>(DynamicBrokerConfig.scala:174)
	at kafka.server.KafkaConfig$$anonfun$3.apply(KafkaConfig.scala:1066)
	at kafka.server.KafkaConfig$$anonfun$3.apply(KafkaConfig.scala:1066)
	at scala.Option.getOrElse(Option.scala:121)
	at kafka.server.KafkaConfig.<init>(KafkaConfig.scala:1066)
	at kafka.server.KafkaConfig.<init>(KafkaConfig.scala:1062)
(19 more lines...)
Collapse Failed RpcKafkaIT testKafkaRpcAtRemoteLocationWithWrongSystemId History
Integration Test 1 sec
java.lang.NoClassDefFoundError: Could not initialize class kafka.utils.Log4jControllerRegistration$
	at kafka.utils.Logging$class.$init$(Logging.scala:47)
	at kafka.server.DynamicBrokerConfig.<init>(DynamicBrokerConfig.scala:174)
	at kafka.server.KafkaConfig$$anonfun$3.apply(KafkaConfig.scala:1066)
	at kafka.server.KafkaConfig$$anonfun$3.apply(KafkaConfig.scala:1066)
	at scala.Option.getOrElse(Option.scala:121)
	at kafka.server.KafkaConfig.<init>(KafkaConfig.scala:1066)
	at kafka.server.KafkaConfig.<init>(KafkaConfig.scala:1062)
(19 more lines...)
Collapse Failed RpcKafkaIT testKafkaRpcAtRemoteLocationWithSystemId History
Integration Test 1 sec
java.lang.NoClassDefFoundError: Could not initialize class kafka.utils.Log4jControllerRegistration$
	at kafka.utils.Logging$class.$init$(Logging.scala:47)
	at kafka.server.DynamicBrokerConfig.<init>(DynamicBrokerConfig.scala:174)
	at kafka.server.KafkaConfig$$anonfun$3.apply(KafkaConfig.scala:1066)
	at kafka.server.KafkaConfig$$anonfun$3.apply(KafkaConfig.scala:1066)
	at scala.Option.getOrElse(Option.scala:121)
	at kafka.server.KafkaConfig.<init>(KafkaConfig.scala:1066)
	at kafka.server.KafkaConfig.<init>(KafkaConfig.scala:1062)
(19 more lines...)
Collapse Failed AdminPageIT testAllLinks History
Smoke Test 15 secs
java.lang.AssertionError: We expect 31 link entries on the admin page. expected:<31> but was:<24>
	at org.opennms.smoketest.AdminPageIT.testAllLinks(AdminPageIT.java:118)
Collapse Failed AdminPageIT testAllTextIsPresent History
Smoke Test 12 secs
java.lang.AssertionError: expected:<10> but was:<9>
	at org.opennms.smoketest.AdminPageIT.testAllTextIsPresent(AdminPageIT.java:100)
Collapse Failed AlarmElasticsearch5IT canForwardAlarmToEs History
Smoke Test 2 mins
com.jayway.awaitility.core.ConditionTimeoutException: Lambda expression in org.opennms.smoketest.AlarmElasticsearch5IT that uses java.net.InetSocketAddress: expected <1L> but was <0> within 2 minutes.
	at org.opennms.smoketest.AlarmElasticsearch5IT.canForwardAlarmToEs(AlarmElasticsearch5IT.java:111)
Collapse Failed ClassificationRulePageIT verifyClassification History
Smoke Test 18 secs
org.openqa.selenium.TimeoutException: Timed out after 5 seconds waiting for org.opennms.smoketest.ClassificationRulePageIT$Page$$Lambda$224/1900226895@6b5de3fd
Build info: version: '2.53.1', revision: 'a36b8b1cd5757287168e54b817830adce9b0158d', time: '2016-06-30 19:26:09'
System info: host: 'bambooagent04.internal.opennms.com', ip: '172.20.1.208', os.name: 'Linux', os.arch: 'amd64', os.version: '4.15.0-46-generic', java.version: '1.8.0_201'
Driver info: org.openqa.selenium.firefox.FirefoxDriver
Capabilities [{applicationCacheEnabled=true, rotatable=false, handlesAlerts=true, databaseEnabled=true, version=45.0.2, platform=LINUX, nativeEvents=false, acceptSslCerts=true, webStorageEnabled=true, locationContextEnabled=true, browserName=firefox, takesScreenshot=true, javascriptEnabled=true, cssSelectorsEnabled=true}]
Session ID: 9dd06e56-10a1-41ea-8852-1cf64f8be9cf
org.openqa.selenium.TimeoutException: 
Timed out after 5 seconds waiting for org.opennms.smoketest.ClassificationRulePageIT$Page$$Lambda$224/1900226895@6b5de3fd
(6 more lines...)
Collapse Failed ClassificationRulePageIT verifyErrorMessageReset History
Smoke Test 18 secs
org.openqa.selenium.TimeoutException: Timed out after 5 seconds waiting for org.opennms.smoketest.ClassificationRulePageIT$Page$$Lambda$224/1900226895@7a1aa217
Build info: version: '2.53.1', revision: 'a36b8b1cd5757287168e54b817830adce9b0158d', time: '2016-06-30 19:26:09'
System info: host: 'bambooagent04.internal.opennms.com', ip: '172.20.1.208', os.name: 'Linux', os.arch: 'amd64', os.version: '4.15.0-46-generic', java.version: '1.8.0_201'
Driver info: org.openqa.selenium.firefox.FirefoxDriver
Capabilities [{applicationCacheEnabled=true, rotatable=false, handlesAlerts=true, databaseEnabled=true, version=45.0.2, platform=LINUX, nativeEvents=false, acceptSslCerts=true, webStorageEnabled=true, locationContextEnabled=true, browserName=firefox, takesScreenshot=true, javascriptEnabled=true, cssSelectorsEnabled=true}]
Session ID: eb70e729-bf31-4a3c-a9c3-07e0af33c815
org.openqa.selenium.TimeoutException: 
Timed out after 5 seconds waiting for org.opennms.smoketest.ClassificationRulePageIT$Page$$Lambda$224/1900226895@7a1aa217
(6 more lines...)
Collapse Failed ClassificationRulePageIT verifySrcValues History
Smoke Test 18 secs
org.openqa.selenium.TimeoutException: Timed out after 5 seconds waiting for org.opennms.smoketest.ClassificationRulePageIT$Page$$Lambda$224/1900226895@1762de20
Build info: version: '2.53.1', revision: 'a36b8b1cd5757287168e54b817830adce9b0158d', time: '2016-06-30 19:26:09'
System info: host: 'bambooagent04.internal.opennms.com', ip: '172.20.1.208', os.name: 'Linux', os.arch: 'amd64', os.version: '4.15.0-46-generic', java.version: '1.8.0_201'
Driver info: org.openqa.selenium.firefox.FirefoxDriver
Capabilities [{applicationCacheEnabled=true, rotatable=false, handlesAlerts=true, databaseEnabled=true, version=45.0.2, platform=LINUX, nativeEvents=false, acceptSslCerts=true, webStorageEnabled=true, locationContextEnabled=true, browserName=firefox, takesScreenshot=true, javascriptEnabled=true, cssSelectorsEnabled=true}]
Session ID: 38db5d9d-1736-4361-b01a-49c097433390
org.openqa.selenium.TimeoutException: 
Timed out after 5 seconds waiting for org.opennms.smoketest.ClassificationRulePageIT$Page$$Lambda$224/1900226895@1762de20
(6 more lines...)
Collapse Failed ClassificationRulePageIT verifyExporterFilter History
Smoke Test 18 secs
org.openqa.selenium.TimeoutException: Timed out after 5 seconds waiting for org.opennms.smoketest.ClassificationRulePageIT$Page$$Lambda$224/1900226895@b4dbb02
Build info: version: '2.53.1', revision: 'a36b8b1cd5757287168e54b817830adce9b0158d', time: '2016-06-30 19:26:09'
System info: host: 'bambooagent04.internal.opennms.com', ip: '172.20.1.208', os.name: 'Linux', os.arch: 'amd64', os.version: '4.15.0-46-generic', java.version: '1.8.0_201'
Driver info: org.openqa.selenium.firefox.FirefoxDriver
Capabilities [{applicationCacheEnabled=true, rotatable=false, handlesAlerts=true, databaseEnabled=true, version=45.0.2, platform=LINUX, nativeEvents=false, acceptSslCerts=true, webStorageEnabled=true, locationContextEnabled=true, browserName=firefox, takesScreenshot=true, javascriptEnabled=true, cssSelectorsEnabled=true}]
Session ID: 678700fd-5fe6-4889-8240-799e2f144f1d
org.openqa.selenium.TimeoutException: 
Timed out after 5 seconds waiting for org.opennms.smoketest.ClassificationRulePageIT$Page$$Lambda$224/1900226895@b4dbb02
(6 more lines...)
Collapse Failed ClassificationRulePageIT verifySearch History
Smoke Test 18 secs
org.openqa.selenium.TimeoutException: Timed out after 5 seconds waiting for org.opennms.smoketest.ClassificationRulePageIT$Page$$Lambda$224/1900226895@69eddf0f
Build info: version: '2.53.1', revision: 'a36b8b1cd5757287168e54b817830adce9b0158d', time: '2016-06-30 19:26:09'
System info: host: 'bambooagent04.internal.opennms.com', ip: '172.20.1.208', os.name: 'Linux', os.arch: 'amd64', os.version: '4.15.0-46-generic', java.version: '1.8.0_201'
Driver info: org.openqa.selenium.firefox.FirefoxDriver
Capabilities [{applicationCacheEnabled=true, rotatable=false, handlesAlerts=true, databaseEnabled=true, version=45.0.2, platform=LINUX, nativeEvents=false, acceptSslCerts=true, webStorageEnabled=true, locationContextEnabled=true, browserName=firefox, takesScreenshot=true, javascriptEnabled=true, cssSelectorsEnabled=true}]
Session ID: 87a155ac-a259-4375-a35e-c1933164aaed
org.openqa.selenium.TimeoutException: 
Timed out after 5 seconds waiting for org.opennms.smoketest.ClassificationRulePageIT$Page$$Lambda$224/1900226895@69eddf0f
(6 more lines...)
Collapse Failed ClassificationRulePageIT verifyTabs History
Smoke Test 18 secs
org.openqa.selenium.TimeoutException: Timed out after 5 seconds waiting for org.opennms.smoketest.ClassificationRulePageIT$Page$$Lambda$224/1900226895@3a62b33a
Build info: version: '2.53.1', revision: 'a36b8b1cd5757287168e54b817830adce9b0158d', time: '2016-06-30 19:26:09'
System info: host: 'bambooagent04.internal.opennms.com', ip: '172.20.1.208', os.name: 'Linux', os.arch: 'amd64', os.version: '4.15.0-46-generic', java.version: '1.8.0_201'
Driver info: org.openqa.selenium.firefox.FirefoxDriver
Capabilities [{applicationCacheEnabled=true, rotatable=false, handlesAlerts=true, databaseEnabled=true, version=45.0.2, platform=LINUX, nativeEvents=false, acceptSslCerts=true, webStorageEnabled=true, locationContextEnabled=true, browserName=firefox, takesScreenshot=true, javascriptEnabled=true, cssSelectorsEnabled=true}]
Session ID: 69ecd7e7-68b6-4ca7-ae0b-caea175bcf16
org.openqa.selenium.TimeoutException: 
Timed out after 5 seconds waiting for org.opennms.smoketest.ClassificationRulePageIT$Page$$Lambda$224/1900226895@3a62b33a
(6 more lines...)
Collapse Failed ClassificationRulePageIT verifyRulePaginationAndDeleteAll History
Smoke Test 20 secs
org.openqa.selenium.TimeoutException: Timed out after 5 seconds waiting for org.opennms.smoketest.ClassificationRulePageIT$Page$$Lambda$224/1900226895@a541380
Build info: version: '2.53.1', revision: 'a36b8b1cd5757287168e54b817830adce9b0158d', time: '2016-06-30 19:26:09'
System info: host: 'bambooagent04.internal.opennms.com', ip: '172.20.1.208', os.name: 'Linux', os.arch: 'amd64', os.version: '4.15.0-46-generic', java.version: '1.8.0_201'
Driver info: org.openqa.selenium.firefox.FirefoxDriver
Capabilities [{applicationCacheEnabled=true, rotatable=false, handlesAlerts=true, databaseEnabled=true, version=45.0.2, platform=LINUX, nativeEvents=false, acceptSslCerts=true, webStorageEnabled=true, locationContextEnabled=true, browserName=firefox, takesScreenshot=true, javascriptEnabled=true, cssSelectorsEnabled=true}]
Session ID: 2339a213-1305-43a2-ad00-ad654aff0f74
org.openqa.selenium.TimeoutException: 
Timed out after 5 seconds waiting for org.opennms.smoketest.ClassificationRulePageIT$Page$$Lambda$224/1900226895@a541380
(6 more lines...)
Collapse Failed ClassificationRulePageIT verifyReadOnlyGroup History
Smoke Test 18 secs
org.openqa.selenium.TimeoutException: Timed out after 5 seconds waiting for org.opennms.smoketest.ClassificationRulePageIT$Page$$Lambda$224/1900226895@1fcfe44
Build info: version: '2.53.1', revision: 'a36b8b1cd5757287168e54b817830adce9b0158d', time: '2016-06-30 19:26:09'
System info: host: 'bambooagent04.internal.opennms.com', ip: '172.20.1.208', os.name: 'Linux', os.arch: 'amd64', os.version: '4.15.0-46-generic', java.version: '1.8.0_201'
Driver info: org.openqa.selenium.firefox.FirefoxDriver
Capabilities [{applicationCacheEnabled=true, rotatable=false, handlesAlerts=true, databaseEnabled=true, version=45.0.2, platform=LINUX, nativeEvents=false, acceptSslCerts=true, webStorageEnabled=true, locationContextEnabled=true, browserName=firefox, takesScreenshot=true, javascriptEnabled=true, cssSelectorsEnabled=true}]
Session ID: d77dc28c-0ed0-441c-8193-c2a679c946fc
org.openqa.selenium.TimeoutException: 
Timed out after 5 seconds waiting for org.opennms.smoketest.ClassificationRulePageIT$Page$$Lambda$224/1900226895@1fcfe44
(6 more lines...)
Collapse Failed ClassificationRulePageIT verifyRuleCRUD History
Smoke Test 18 secs
org.openqa.selenium.TimeoutException: Timed out after 5 seconds waiting for org.opennms.smoketest.ClassificationRulePageIT$Page$$Lambda$224/1900226895@d2f5b3a
Build info: version: '2.53.1', revision: 'a36b8b1cd5757287168e54b817830adce9b0158d', time: '2016-06-30 19:26:09'
System info: host: 'bambooagent04.internal.opennms.com', ip: '172.20.1.208', os.name: 'Linux', os.arch: 'amd64', os.version: '4.15.0-46-generic', java.version: '1.8.0_201'
Driver info: org.openqa.selenium.firefox.FirefoxDriver
Capabilities [{applicationCacheEnabled=true, rotatable=false, handlesAlerts=true, databaseEnabled=true, version=45.0.2, platform=LINUX, nativeEvents=false, acceptSslCerts=true, webStorageEnabled=true, locationContextEnabled=true, browserName=firefox, takesScreenshot=true, javascriptEnabled=true, cssSelectorsEnabled=true}]
Session ID: 191365e3-113e-412b-a6ca-447d59a673a3
org.openqa.selenium.TimeoutException: 
Timed out after 5 seconds waiting for org.opennms.smoketest.ClassificationRulePageIT$Page$$Lambda$224/1900226895@d2f5b3a
(6 more lines...)
Collapse Failed ClassificationRulePageIT verifySettingsTab History
Smoke Test 18 secs
org.openqa.selenium.TimeoutException: Timed out after 5 seconds waiting for org.opennms.smoketest.ClassificationRulePageIT$Page$$Lambda$224/1900226895@558856fa
Build info: version: '2.53.1', revision: 'a36b8b1cd5757287168e54b817830adce9b0158d', time: '2016-06-30 19:26:09'
System info: host: 'bambooagent04.internal.opennms.com', ip: '172.20.1.208', os.name: 'Linux', os.arch: 'amd64', os.version: '4.15.0-46-generic', java.version: '1.8.0_201'
Driver info: org.openqa.selenium.firefox.FirefoxDriver
Capabilities [{applicationCacheEnabled=true, rotatable=false, handlesAlerts=true, databaseEnabled=true, version=45.0.2, platform=LINUX, nativeEvents=false, acceptSslCerts=true, webStorageEnabled=true, locationContextEnabled=true, browserName=firefox, takesScreenshot=true, javascriptEnabled=true, cssSelectorsEnabled=true}]
Session ID: 29d22035-797e-4d16-837f-fc5b20aa4348
org.openqa.selenium.TimeoutException: 
Timed out after 5 seconds waiting for org.opennms.smoketest.ClassificationRulePageIT$Page$$Lambda$224/1900226895@558856fa
(6 more lines...)
Collapse Failed ClassificationRestIT verifyGetNonExisting History
Smoke Test 12 secs
java.lang.AssertionError: 1 expectation failed.
Expected status code <200> but was <404>.

java.lang.AssertionError: 
1 expectation failed.
Expected status code <200> but was <404>.

	at org.opennms.smoketest.flow.ClassificationRestIT.setEnabled(ClassificationRestIT.java:333)
(1 more lines...)
Collapse Failed ClassificationRestIT verifyDisableGroup History
Smoke Test 12 secs
java.lang.AssertionError: 1 expectation failed.
Expected status code <200> but was <404>.

java.lang.AssertionError: 
1 expectation failed.
Expected status code <200> but was <404>.

	at org.opennms.smoketest.flow.ClassificationRestIT.setEnabled(ClassificationRestIT.java:333)
(1 more lines...)
Collapse Failed ClassificationRestIT verifyCreateNull History
Smoke Test 12 secs
java.lang.AssertionError: 1 expectation failed.
Expected status code <200> but was <404>.

java.lang.AssertionError: 
1 expectation failed.
Expected status code <200> but was <404>.

	at org.opennms.smoketest.flow.ClassificationRestIT.setEnabled(ClassificationRestIT.java:333)
(1 more lines...)
Collapse Failed ClassificationRestIT verifyCRUD History
Smoke Test 12 secs
java.lang.AssertionError: 1 expectation failed.
Expected status code <200> but was <404>.

java.lang.AssertionError: 
1 expectation failed.
Expected status code <200> but was <404>.

	at org.opennms.smoketest.flow.ClassificationRestIT.setEnabled(ClassificationRestIT.java:333)
(1 more lines...)
Collapse Failed ClassificationRestIT verifyUpdateNonExisting History
Smoke Test 14 secs
java.lang.AssertionError: 1 expectation failed.
Expected status code <200> but was <404>.

java.lang.AssertionError: 
1 expectation failed.
Expected status code <200> but was <404>.

	at org.opennms.smoketest.flow.ClassificationRestIT.setEnabled(ClassificationRestIT.java:333)
(1 more lines...)
Collapse Failed ClassificationRestIT verifyExportGroup History
Smoke Test 12 secs
java.lang.AssertionError: 1 expectation failed.
Expected status code <200> but was <404>.

java.lang.AssertionError: 
1 expectation failed.
Expected status code <200> but was <404>.

	at org.opennms.smoketest.flow.ClassificationRestIT.setEnabled(ClassificationRestIT.java:333)
(1 more lines...)
Collapse Failed ClassificationRestIT verifyProtocols History
Smoke Test 12 secs
java.lang.AssertionError: 1 expectation failed.
Expected status code <200> but was <404>.

java.lang.AssertionError: 
1 expectation failed.
Expected status code <200> but was <404>.

	at org.opennms.smoketest.flow.ClassificationRestIT.setEnabled(ClassificationRestIT.java:333)
(1 more lines...)
Collapse Failed ClassificationRestIT verifyDeleteNonExisting History
Smoke Test 12 secs
java.lang.AssertionError: 1 expectation failed.
Expected status code <200> but was <404>.

java.lang.AssertionError: 
1 expectation failed.
Expected status code <200> but was <404>.

	at org.opennms.smoketest.flow.ClassificationRestIT.setEnabled(ClassificationRestIT.java:333)
(1 more lines...)
Collapse Failed ClassificationRestIT verifyClassify History
Smoke Test 12 secs
java.lang.AssertionError: 1 expectation failed.
Expected status code <200> but was <404>.

java.lang.AssertionError: 
1 expectation failed.
Expected status code <200> but was <404>.

	at org.opennms.smoketest.flow.ClassificationRestIT.setEnabled(ClassificationRestIT.java:333)
(1 more lines...)
Collapse Failed ClassificationRestIT verifyImport History
Smoke Test 12 secs
java.lang.AssertionError: 1 expectation failed.
Expected status code <200> but was <404>.

java.lang.AssertionError: 
1 expectation failed.
Expected status code <200> but was <404>.

	at org.opennms.smoketest.flow.ClassificationRestIT.setEnabled(ClassificationRestIT.java:333)
(1 more lines...)
Collapse Failed ClassificationRestIT verifyClassifyEmpty History
Smoke Test 12 secs
java.lang.AssertionError: 1 expectation failed.
Expected status code <200> but was <404>.

java.lang.AssertionError: 
1 expectation failed.
Expected status code <200> but was <404>.

	at org.opennms.smoketest.flow.ClassificationRestIT.setEnabled(ClassificationRestIT.java:333)
(1 more lines...)
Collapse Failed FlowStackIT verifyFlowStack History
Smoke Test 2 mins
com.jayway.awaitility.core.ConditionTimeoutException: Condition with lambda expression in org.opennms.smoketest.telemetry.FlowTester that uses org.opennms.smoketest.telemetry.FlowTester$Block was not fulfilled within 1 minutes.
	at org.opennms.smoketest.flow.FlowStackIT.verifyFlowStack(FlowStackIT.java:98)
Collapse Failed SinglePortFlowsIT verifyFlowStack History
Smoke Test 2 mins
com.jayway.awaitility.core.ConditionTimeoutException: Condition with lambda expression in org.opennms.smoketest.telemetry.FlowTester that uses org.opennms.smoketest.telemetry.FlowTester$Block was not fulfilled within 1 minutes.
	at org.opennms.smoketest.flow.SinglePortFlowsIT.verifyFlowStack(SinglePortFlowsIT.java:100)
Collapse Failed HealthCheckIT verifyOpenNMSHealth History
Smoke Test 5 mins
com.jayway.awaitility.core.ConditionTimeoutException: Condition with lambda expression in org.opennms.smoketest.health.HealthCheckIT was not fulfilled within 5 minutes.
	at org.opennms.smoketest.health.HealthCheckIT.verifyHealthCheck(HealthCheckIT.java:126)
	at org.opennms.smoketest.health.HealthCheckIT.verifyOpenNMSHealth(HealthCheckIT.java:104)
Collapse Failed IndexPageIT verifyStatusMap History
Smoke Test 2 mins
org.openqa.selenium.TimeoutException: Timed out after 120 seconds waiting for org.opennms.smoketest.IndexPageIT$1@76f10035
Build info: version: '2.53.1', revision: 'a36b8b1cd5757287168e54b817830adce9b0158d', time: '2016-06-30 19:26:09'
System info: host: 'bambooagent04.internal.opennms.com', ip: '172.20.1.208', os.name: 'Linux', os.arch: 'amd64', os.version: '4.15.0-46-generic', java.version: '1.8.0_201'
Driver info: org.openqa.selenium.firefox.FirefoxDriver
Capabilities [{applicationCacheEnabled=true, rotatable=false, handlesAlerts=true, databaseEnabled=true, version=45.0.2, platform=LINUX, nativeEvents=false, acceptSslCerts=true, webStorageEnabled=true, locationContextEnabled=true, browserName=firefox, takesScreenshot=true, javascriptEnabled=true, cssSelectorsEnabled=true}]
Session ID: b3ff9786-41e6-4351-a509-e2c2baf22a85
org.openqa.selenium.TimeoutException: 
Timed out after 120 seconds waiting for org.opennms.smoketest.IndexPageIT$1@76f10035
(6 more lines...)
Collapse Failed IntegrationAPIIT canLoadSampleProject History
Smoke Test 2 mins
com.jayway.awaitility.core.ConditionTimeoutException: Condition with lambda expression in org.opennms.smoketest.IntegrationAPIIT that uses java.net.InetSocketAddress, java.net.InetSocketAddressjava.lang.String was not fulfilled within 2 minutes.
	at org.opennms.smoketest.IntegrationAPIIT.verifyHealthCheckWithDescription(IntegrationAPIIT.java:96)
	at org.opennms.smoketest.IntegrationAPIIT.canLoadSampleProject(IntegrationAPIIT.java:89)
Collapse Failed JmxConfigurationGeneratorIT verifyCompMemberSelection History
Smoke Test 2 mins
org.openqa.selenium.TimeoutException: Timed out after 120 seconds waiting for org.opennms.smoketest.OpenNMSSeleniumTestCase$14@1a01d7f0
Build info: version: '2.53.1', revision: 'a36b8b1cd5757287168e54b817830adce9b0158d', time: '2016-06-30 19:26:09'
System info: host: 'bambooagent04.internal.opennms.com', ip: '172.20.1.208', os.name: 'Linux', os.arch: 'amd64', os.version: '4.15.0-46-generic', java.version: '1.8.0_201'
Driver info: org.openqa.selenium.firefox.FirefoxDriver
Capabilities [{applicationCacheEnabled=true, rotatable=false, handlesAlerts=true, databaseEnabled=true, version=45.0.2, platform=LINUX, nativeEvents=false, acceptSslCerts=true, webStorageEnabled=true, locationContextEnabled=true, browserName=firefox, takesScreenshot=true, javascriptEnabled=true, cssSelectorsEnabled=true}]
Session ID: d88d4237-8073-466e-8f13-b0832ba133ad
org.openqa.selenium.TimeoutException: 
Timed out after 120 seconds waiting for org.opennms.smoketest.OpenNMSSeleniumTestCase$14@1a01d7f0
(7 more lines...)
Collapse Failed JmxConfigurationGeneratorIT testClickOnHeaderLinkWorks History
Smoke Test 2 mins
org.openqa.selenium.NoSuchElementException: Unable to locate element: {"method":"link text","selector":"1. Service Configuration"}
Command duration or timeout: 120.14 seconds
For documentation on this error, please visit: http://seleniumhq.org/exceptions/no_such_element.html
Build info: version: '2.53.1', revision: 'a36b8b1cd5757287168e54b817830adce9b0158d', time: '2016-06-30 19:26:09'
System info: host: 'bambooagent04.internal.opennms.com', ip: '172.20.1.208', os.name: 'Linux', os.arch: 'amd64', os.version: '4.15.0-46-generic', java.version: '1.8.0_201'
Driver info: org.openqa.selenium.firefox.FirefoxDriver
Capabilities [{applicationCacheEnabled=true, rotatable=false, handlesAlerts=true, databaseEnabled=true, version=45.0.2, platform=LINUX, nativeEvents=false, acceptSslCerts=true, webStorageEnabled=true, locationContextEnabled=true, browserName=firefox, takesScreenshot=true, javascriptEnabled=true, cssSelectorsEnabled=true}]
Session ID: 4b048767-abda-4be9-a2dd-c3c87503c8c6
(18 more lines...)
Collapse Failed JmxConfigurationGeneratorIT testNavigation History
Smoke Test 2 mins
org.openqa.selenium.TimeoutException: Timed out after 120 seconds waiting for org.opennms.smoketest.OpenNMSSeleniumTestCase$14@516592b1
Build info: version: '2.53.1', revision: 'a36b8b1cd5757287168e54b817830adce9b0158d', time: '2016-06-30 19:26:09'
System info: host: 'bambooagent04.internal.opennms.com', ip: '172.20.1.208', os.name: 'Linux', os.arch: 'amd64', os.version: '4.15.0-46-generic', java.version: '1.8.0_201'
Driver info: org.openqa.selenium.firefox.FirefoxDriver
Capabilities [{applicationCacheEnabled=true, rotatable=false, handlesAlerts=true, databaseEnabled=true, version=45.0.2, platform=LINUX, nativeEvents=false, acceptSslCerts=true, webStorageEnabled=true, locationContextEnabled=true, browserName=firefox, takesScreenshot=true, javascriptEnabled=true, cssSelectorsEnabled=true}]
Session ID: 85666784-85c9-4a08-9e73-20c6e4e15306
org.openqa.selenium.TimeoutException: 
Timed out after 120 seconds waiting for org.opennms.smoketest.OpenNMSSeleniumTestCase$14@516592b1
(7 more lines...)
Collapse Failed KafkaPersisterIT testKafkaPersisterForMetrics History
Smoke Test 2 mins
com.jayway.awaitility.core.ConditionTimeoutException: Lambda expression in org.opennms.smoketest.BaseKafkaPersisterIT: expected a string containing "Persisted collection" but was <collection:collect --node 2 --persist org.opennms.netmgt.collectd.SnmpCollector 172.17.0.5
logout

   ____                   _   _ __  __  _____  
  / __ \                 | \ | |  \/  |/ ____| 
 | |  | |_ __   ___ _ __ |  \| | \  / | (___   
 | |  | | '_ \ / _ \ '_ \| . ` | |\/| |\___ \  
 | |__| | |_) |  __/ | | | |\  | |  | |____) | 
(55 more lines...)
Collapse Failed KafkaProducerIT testKafkaAlarmStoreData History
Smoke Test 2 mins
com.jayway.awaitility.core.ConditionTimeoutException: Lambda expression in org.opennms.smoketest.KafkaProducerIT: expected a string containing "uei.opennms.org/alarms/trigger:::kafka-producer-test" but was <
Command not found: kafka-producer:list-alarms
admin@opennms> logout
> within 2 minutes.
com.jayway.awaitility.core.ConditionTimeoutException: 
Lambda expression in org.opennms.smoketest.KafkaProducerIT: expected a string containing "uei.opennms.org/alarms/trigger:::kafka-producer-test" but was <

Command not found: kafka-producer:list-alarms
(4 more lines...)
Collapse Failed KafkaProducerIT testKafkaPersisterForMetrics History
Smoke Test 2 mins
com.jayway.awaitility.core.ConditionTimeoutException: Lambda expression in org.opennms.smoketest.BaseKafkaPersisterIT: expected a string containing "Persisted collection" but was <
   ____                   _   _ __  __  _____  
  / __ \                 | \ | |  \/  |/ ____| 
 | |  | |_ __   ___ _ __ |  \| | \  / | (___   
 | |  | | '_ \ / _ \ '_ \| . ` | |\/| |\___ \  
 | |__| | |_) |  __/ | | | |\  | |  | |____) | 
  \____/| .__/ \___|_| |_|_| \_|_|  |_|_____/  
        | |                                    
(51 more lines...)
Collapse Failed MenuHeaderIT testMenuEntries History
Smoke Test 2 mins
org.openqa.selenium.TimeoutException: Timed out after 120 seconds waiting for visibility of element located by By.xpath: //span[text()='Surveillance view: default']
Build info: version: '2.53.1', revision: 'a36b8b1cd5757287168e54b817830adce9b0158d', time: '2016-06-30 19:26:09'
System info: host: 'bambooagent04.internal.opennms.com', ip: '172.20.1.208', os.name: 'Linux', os.arch: 'amd64', os.version: '4.15.0-46-generic', java.version: '1.8.0_201'
Driver info: org.openqa.selenium.firefox.FirefoxDriver
Capabilities [{applicationCacheEnabled=true, rotatable=false, handlesAlerts=true, databaseEnabled=true, version=45.0.2, platform=LINUX, nativeEvents=false, acceptSslCerts=true, webStorageEnabled=true, locationContextEnabled=true, browserName=firefox, takesScreenshot=true, javascriptEnabled=true, cssSelectorsEnabled=true}]
Session ID: adda3ef1-e174-4c9c-9b2e-a0235e7d6ae7
org.openqa.selenium.TimeoutException: 
Timed out after 120 seconds waiting for visibility of element located by By.xpath: //span[text()='Surveillance view: default']
(23 more lines...)
Collapse Failed CollectorListIT canLoadCollectorsOnOpenNMS History
Smoke Test 3 mins
com.jayway.awaitility.core.ConditionTimeoutException: Lambda expression in org.opennms.smoketest.minion.CollectorListIT: expected a collection with size <0> but was <[org.opennms.netmgt.collectd.SnmpCollector, org.opennms.netmgt.collectd.HttpCollector, org.opennms.netmgt.collectd.JdbcCollector, org.opennms.netmgt.collectd.Jsr160Collector, org.opennms.netmgt.collectd.VmwareCimCollector, org.opennms.netmgt.collectd.VmwareCollector, org.opennms.netmgt.collectd.WmiCollector, org.opennms.netmgt.collectd.WsManCollector, org.opennms.protocols.xml.collector.XmlCollector]> within 3 minutes.
	at org.opennms.smoketest.minion.CollectorListIT.canLoadCollectorsOnOpenNMS(CollectorListIT.java:119)
Collapse Failed DetectorsCommandIT canLoadDetectorsOnOpenNMS History
Smoke Test 3 mins
com.jayway.awaitility.core.ConditionTimeoutException: Lambda expression in org.opennms.smoketest.minion.DetectorsCommandIT: expected a collection with size <0> but was <[BGP_Session, BSF, CITRIX, Cisco_IP_SLA, DHCP, DNS, Dell_OpenManageChassis, DiskUsage, DominoIIOP, FTP, GP, HOST-RESOURCES, HTTP, HTTPS, ICMP, IMAP, IMAPS, JDBC, JSR160, JdbcQueryDetector, JdbcStoredProcedureDetector, LDAP, LDAPS, LOOP, MSExchange, Memcached, NOTES, NRPE, NTP, OMSAStorage, PERC, POP3, SMB, SMTP, SNMP, SSH, TCP, TrivialTime, WEB, WMI, WS-Man, WsManWQLService, Win32Service]> within 3 minutes.
	at org.opennms.smoketest.minion.DetectorsCommandIT.canLoadDetectorsOnOpenNMS(DetectorsCommandIT.java:153)
Collapse Failed JMXCollectorIT canPerformAdhocJmxCollection History
Smoke Test 3 mins
com.jayway.awaitility.core.ConditionTimeoutException: Lambda expression in org.opennms.smoketest.minion.JMXCollectorIT: expected a string containing "java_lang_type_OperatingSystem" but was < -l MINION org.opennms.netmgt.collectd.Jsr160Collector 127.0.0.1 port=18980
Command not found: collection:collect
admin@opennms> logout
> within 3 minutes.
com.jayway.awaitility.core.ConditionTimeoutException: 
Lambda expression in org.opennms.smoketest.minion.JMXCollectorIT: expected a string containing "java_lang_type_OperatingSystem" but was < -l MINION org.opennms.netmgt.collectd.Jsr160Collector 127.0.0.1 port=18980

Command not found: collection:collect
(4 more lines...)