Build #72

Build: #72 failed Changes by Jesse White

Build result summary

Details

Completed
Duration
1694 minutes
Labels
None
Revisions
OpenNMS (develop branch)
a226b768365b1bac0ca8ff6e0571d7d7c5abd1e3 a226b768365b1bac0ca8ff6e0571d7d7c5abd1e3
OpenNMS Installer
da12784d9ab4ba4aacedec0283d0c04075fd6ebf da12784d9ab4ba4aacedec0283d0c04075fd6ebf
OpenNMS-Repo
088d710674109759251f42c6720d74ea80cf3f13 088d710674109759251f42c6720d74ea80cf3f13
Smoke Tests
cb1e72265cf2ce10cb4872f58120272b340a1ce1 cb1e72265cf2ce10cb4872f58120272b340a1ce1
OpenNMS Bamboo Utils
0a62053bc90f6ffcce1e17256674b2dae7b4f8a3 0a62053bc90f6ffcce1e17256674b2dae7b4f8a3
OpenNMS System Test API
2f3a985377db43ce9b451390b9744bac402ffbd7 2f3a985377db43ce9b451390b9744bac402ffbd7
Total tests
7887
Fixed in
#75 (Manual run by Benjamin Reed)

Tests

Responsible

Branch integration details

Checked out
release-24.0.0 0986da3495815eaeb08ef47d42e6416592d56cfe
Merged with
foundation-2018 a226b768365b1bac0ca8ff6e0571d7d7c5abd1e3 a226b768365b1bac0ca8ff6e0571d7d7c5abd1e3

Code commits

OpenNMS (develop branch)
Author Commit Message Commit date
Jesse White Jesse White a226b768365b1bac0ca8ff6e0571d7d7c5abd1e3 a226b768365b1bac0ca8ff6e0571d7d7c5abd1e3 Merge pull request #2395 from OpenNMS/ag/jira/NMS-10609
NMS-10609: The MIB Compiler is unable to parse certain MIBs
Alejandro Galue Alejandro Galue 744d8d9be0aedabadfb8ed8f84839bea98e7b8e4 m 744d8d9be0aedabadfb8ed8f84839bea98e7b8e4 Fix for Bug NMS-10609
The MIB Compiler is unable to parse certain MIBs.

A few welfomed MIBs were not properly parsed, due to a problem with
the necessary loop required by the third party library we use to
parse MIB dependencies.

All the existing tests and the new test added here (NMS10609Test)
are passing without issues. Without the fix, the new test fails.

Tests

New test failures 82
Status Test View job Duration
Collapse Failed AdminPageIT testAllTextIsPresent History
Smoke Test 13 secs
java.lang.AssertionError: expected:<10> but was:<9>
	at org.opennms.smoketest.AdminPageIT.testAllTextIsPresent(AdminPageIT.java:100)
Collapse Failed AdminPageIT testAllLinks History
Smoke Test 16 secs
java.lang.AssertionError: We expect 31 link entries on the admin page. expected:<31> but was:<24>
	at org.opennms.smoketest.AdminPageIT.testAllLinks(AdminPageIT.java:118)
Collapse Failed AlarmElasticsearch5IT canForwardAlarmToEs History
Smoke Test 2 mins
com.jayway.awaitility.core.ConditionTimeoutException: Lambda expression in org.opennms.smoketest.AlarmElasticsearch5IT that uses java.net.InetSocketAddress: expected <1L> but was <0> within 2 minutes.
	at org.opennms.smoketest.AlarmElasticsearch5IT.canForwardAlarmToEs(AlarmElasticsearch5IT.java:111)
Collapse Failed ClassificationRulePageIT verifyRulePaginationAndDeleteAll History
Smoke Test 21 secs
org.openqa.selenium.TimeoutException: Timed out after 5 seconds waiting for org.opennms.smoketest.ClassificationRulePageIT$Page$$Lambda$116/320155726@54bd81a
Build info: version: '2.53.1', revision: 'a36b8b1cd5757287168e54b817830adce9b0158d', time: '2016-06-30 19:26:09'
System info: host: 'cmu.internal.opennms.com', ip: '172.20.1.203', os.name: 'Linux', os.arch: 'amd64', os.version: '4.18.0-16-generic', java.version: '1.8.0_201'
Driver info: org.openqa.selenium.firefox.FirefoxDriver
Capabilities [{applicationCacheEnabled=true, rotatable=false, handlesAlerts=true, databaseEnabled=true, version=45.0.2, platform=LINUX, nativeEvents=false, acceptSslCerts=true, webStorageEnabled=true, locationContextEnabled=true, browserName=firefox, takesScreenshot=true, javascriptEnabled=true, cssSelectorsEnabled=true}]
Session ID: ec07944e-a075-48ab-8c14-3603ad762ccf
org.openqa.selenium.TimeoutException: 
Timed out after 5 seconds waiting for org.opennms.smoketest.ClassificationRulePageIT$Page$$Lambda$116/320155726@54bd81a
(6 more lines...)
Collapse Failed ClassificationRulePageIT verifySrcValues History
Smoke Test 18 secs
org.openqa.selenium.TimeoutException: Timed out after 5 seconds waiting for org.opennms.smoketest.ClassificationRulePageIT$Page$$Lambda$116/320155726@66834435
Build info: version: '2.53.1', revision: 'a36b8b1cd5757287168e54b817830adce9b0158d', time: '2016-06-30 19:26:09'
System info: host: 'cmu.internal.opennms.com', ip: '172.20.1.203', os.name: 'Linux', os.arch: 'amd64', os.version: '4.18.0-16-generic', java.version: '1.8.0_201'
Driver info: org.openqa.selenium.firefox.FirefoxDriver
Capabilities [{applicationCacheEnabled=true, rotatable=false, handlesAlerts=true, databaseEnabled=true, version=45.0.2, platform=LINUX, nativeEvents=false, acceptSslCerts=true, webStorageEnabled=true, locationContextEnabled=true, browserName=firefox, takesScreenshot=true, javascriptEnabled=true, cssSelectorsEnabled=true}]
Session ID: e4c78d64-ae18-4161-82c9-79cf9fd08a38
org.openqa.selenium.TimeoutException: 
Timed out after 5 seconds waiting for org.opennms.smoketest.ClassificationRulePageIT$Page$$Lambda$116/320155726@66834435
(6 more lines...)
Collapse Failed ClassificationRulePageIT verifyExporterFilter History
Smoke Test 18 secs
org.openqa.selenium.TimeoutException: Timed out after 5 seconds waiting for org.opennms.smoketest.ClassificationRulePageIT$Page$$Lambda$116/320155726@930efb
Build info: version: '2.53.1', revision: 'a36b8b1cd5757287168e54b817830adce9b0158d', time: '2016-06-30 19:26:09'
System info: host: 'cmu.internal.opennms.com', ip: '172.20.1.203', os.name: 'Linux', os.arch: 'amd64', os.version: '4.18.0-16-generic', java.version: '1.8.0_201'
Driver info: org.openqa.selenium.firefox.FirefoxDriver
Capabilities [{applicationCacheEnabled=true, rotatable=false, handlesAlerts=true, databaseEnabled=true, version=45.0.2, platform=LINUX, nativeEvents=false, acceptSslCerts=true, webStorageEnabled=true, locationContextEnabled=true, browserName=firefox, takesScreenshot=true, javascriptEnabled=true, cssSelectorsEnabled=true}]
Session ID: dbb763bb-efe6-4295-8f6a-856ac8c4d17f
org.openqa.selenium.TimeoutException: 
Timed out after 5 seconds waiting for org.opennms.smoketest.ClassificationRulePageIT$Page$$Lambda$116/320155726@930efb
(6 more lines...)
Collapse Failed ClassificationRulePageIT verifySearch History
Smoke Test 18 secs
org.openqa.selenium.TimeoutException: Timed out after 5 seconds waiting for org.opennms.smoketest.ClassificationRulePageIT$Page$$Lambda$116/320155726@79ee317d
Build info: version: '2.53.1', revision: 'a36b8b1cd5757287168e54b817830adce9b0158d', time: '2016-06-30 19:26:09'
System info: host: 'cmu.internal.opennms.com', ip: '172.20.1.203', os.name: 'Linux', os.arch: 'amd64', os.version: '4.18.0-16-generic', java.version: '1.8.0_201'
Driver info: org.openqa.selenium.firefox.FirefoxDriver
Capabilities [{applicationCacheEnabled=true, rotatable=false, handlesAlerts=true, databaseEnabled=true, version=45.0.2, platform=LINUX, nativeEvents=false, acceptSslCerts=true, webStorageEnabled=true, locationContextEnabled=true, browserName=firefox, takesScreenshot=true, javascriptEnabled=true, cssSelectorsEnabled=true}]
Session ID: 3e2e617e-f41e-4ef0-9f93-fedc023101f6
org.openqa.selenium.TimeoutException: 
Timed out after 5 seconds waiting for org.opennms.smoketest.ClassificationRulePageIT$Page$$Lambda$116/320155726@79ee317d
(6 more lines...)
Collapse Failed ClassificationRulePageIT verifyTabs History
Smoke Test 18 secs
org.openqa.selenium.TimeoutException: Timed out after 5 seconds waiting for org.opennms.smoketest.ClassificationRulePageIT$Page$$Lambda$116/320155726@5f684f92
Build info: version: '2.53.1', revision: 'a36b8b1cd5757287168e54b817830adce9b0158d', time: '2016-06-30 19:26:09'
System info: host: 'cmu.internal.opennms.com', ip: '172.20.1.203', os.name: 'Linux', os.arch: 'amd64', os.version: '4.18.0-16-generic', java.version: '1.8.0_201'
Driver info: org.openqa.selenium.firefox.FirefoxDriver
Capabilities [{applicationCacheEnabled=true, rotatable=false, handlesAlerts=true, databaseEnabled=true, version=45.0.2, platform=LINUX, nativeEvents=false, acceptSslCerts=true, webStorageEnabled=true, locationContextEnabled=true, browserName=firefox, takesScreenshot=true, javascriptEnabled=true, cssSelectorsEnabled=true}]
Session ID: ad1a72a1-9360-44f3-9fdb-ed04fba2b404
org.openqa.selenium.TimeoutException: 
Timed out after 5 seconds waiting for org.opennms.smoketest.ClassificationRulePageIT$Page$$Lambda$116/320155726@5f684f92
(6 more lines...)
Collapse Failed ClassificationRulePageIT verifyRuleCRUD History
Smoke Test 18 secs
org.openqa.selenium.TimeoutException: Timed out after 5 seconds waiting for org.opennms.smoketest.ClassificationRulePageIT$Page$$Lambda$116/320155726@24c55329
Build info: version: '2.53.1', revision: 'a36b8b1cd5757287168e54b817830adce9b0158d', time: '2016-06-30 19:26:09'
System info: host: 'cmu.internal.opennms.com', ip: '172.20.1.203', os.name: 'Linux', os.arch: 'amd64', os.version: '4.18.0-16-generic', java.version: '1.8.0_201'
Driver info: org.openqa.selenium.firefox.FirefoxDriver
Capabilities [{applicationCacheEnabled=true, rotatable=false, handlesAlerts=true, databaseEnabled=true, version=45.0.2, platform=LINUX, nativeEvents=false, acceptSslCerts=true, webStorageEnabled=true, locationContextEnabled=true, browserName=firefox, takesScreenshot=true, javascriptEnabled=true, cssSelectorsEnabled=true}]
Session ID: f504191c-7f35-4e41-af8f-48da10c2b653
org.openqa.selenium.TimeoutException: 
Timed out after 5 seconds waiting for org.opennms.smoketest.ClassificationRulePageIT$Page$$Lambda$116/320155726@24c55329
(6 more lines...)
Collapse Failed ClassificationRulePageIT verifyClassification History
Smoke Test 18 secs
org.openqa.selenium.TimeoutException: Timed out after 5 seconds waiting for org.opennms.smoketest.ClassificationRulePageIT$Page$$Lambda$116/320155726@39987732
Build info: version: '2.53.1', revision: 'a36b8b1cd5757287168e54b817830adce9b0158d', time: '2016-06-30 19:26:09'
System info: host: 'cmu.internal.opennms.com', ip: '172.20.1.203', os.name: 'Linux', os.arch: 'amd64', os.version: '4.18.0-16-generic', java.version: '1.8.0_201'
Driver info: org.openqa.selenium.firefox.FirefoxDriver
Capabilities [{applicationCacheEnabled=true, rotatable=false, handlesAlerts=true, databaseEnabled=true, version=45.0.2, platform=LINUX, nativeEvents=false, acceptSslCerts=true, webStorageEnabled=true, locationContextEnabled=true, browserName=firefox, takesScreenshot=true, javascriptEnabled=true, cssSelectorsEnabled=true}]
Session ID: 7dcda75e-d22a-4c3c-a071-743bfbb87790
org.openqa.selenium.TimeoutException: 
Timed out after 5 seconds waiting for org.opennms.smoketest.ClassificationRulePageIT$Page$$Lambda$116/320155726@39987732
(6 more lines...)
Collapse Failed ClassificationRulePageIT verifySettingsTab History
Smoke Test 18 secs
org.openqa.selenium.TimeoutException: Timed out after 5 seconds waiting for org.opennms.smoketest.ClassificationRulePageIT$Page$$Lambda$116/320155726@a51e86e
Build info: version: '2.53.1', revision: 'a36b8b1cd5757287168e54b817830adce9b0158d', time: '2016-06-30 19:26:09'
System info: host: 'cmu.internal.opennms.com', ip: '172.20.1.203', os.name: 'Linux', os.arch: 'amd64', os.version: '4.18.0-16-generic', java.version: '1.8.0_201'
Driver info: org.openqa.selenium.firefox.FirefoxDriver
Capabilities [{applicationCacheEnabled=true, rotatable=false, handlesAlerts=true, databaseEnabled=true, version=45.0.2, platform=LINUX, nativeEvents=false, acceptSslCerts=true, webStorageEnabled=true, locationContextEnabled=true, browserName=firefox, takesScreenshot=true, javascriptEnabled=true, cssSelectorsEnabled=true}]
Session ID: 8a4b43f1-2c08-49f4-b8f1-80bab94a7adb
org.openqa.selenium.TimeoutException: 
Timed out after 5 seconds waiting for org.opennms.smoketest.ClassificationRulePageIT$Page$$Lambda$116/320155726@a51e86e
(6 more lines...)
Collapse Failed ClassificationRulePageIT verifyErrorMessageReset History
Smoke Test 18 secs
org.openqa.selenium.TimeoutException: Timed out after 5 seconds waiting for org.opennms.smoketest.ClassificationRulePageIT$Page$$Lambda$116/320155726@6e59d7f6
Build info: version: '2.53.1', revision: 'a36b8b1cd5757287168e54b817830adce9b0158d', time: '2016-06-30 19:26:09'
System info: host: 'cmu.internal.opennms.com', ip: '172.20.1.203', os.name: 'Linux', os.arch: 'amd64', os.version: '4.18.0-16-generic', java.version: '1.8.0_201'
Driver info: org.openqa.selenium.firefox.FirefoxDriver
Capabilities [{applicationCacheEnabled=true, rotatable=false, handlesAlerts=true, databaseEnabled=true, version=45.0.2, platform=LINUX, nativeEvents=false, acceptSslCerts=true, webStorageEnabled=true, locationContextEnabled=true, browserName=firefox, takesScreenshot=true, javascriptEnabled=true, cssSelectorsEnabled=true}]
Session ID: bb737000-0ef9-48df-8bd7-36584009c1a1
org.openqa.selenium.TimeoutException: 
Timed out after 5 seconds waiting for org.opennms.smoketest.ClassificationRulePageIT$Page$$Lambda$116/320155726@6e59d7f6
(6 more lines...)
Collapse Failed ClassificationRulePageIT verifyReadOnlyGroup History
Smoke Test 18 secs
org.openqa.selenium.TimeoutException: Timed out after 5 seconds waiting for org.opennms.smoketest.ClassificationRulePageIT$Page$$Lambda$116/320155726@6878c82c
Build info: version: '2.53.1', revision: 'a36b8b1cd5757287168e54b817830adce9b0158d', time: '2016-06-30 19:26:09'
System info: host: 'cmu.internal.opennms.com', ip: '172.20.1.203', os.name: 'Linux', os.arch: 'amd64', os.version: '4.18.0-16-generic', java.version: '1.8.0_201'
Driver info: org.openqa.selenium.firefox.FirefoxDriver
Capabilities [{applicationCacheEnabled=true, rotatable=false, handlesAlerts=true, databaseEnabled=true, version=45.0.2, platform=LINUX, nativeEvents=false, acceptSslCerts=true, webStorageEnabled=true, locationContextEnabled=true, browserName=firefox, takesScreenshot=true, javascriptEnabled=true, cssSelectorsEnabled=true}]
Session ID: 0ce4640b-a124-4976-b12c-3ca7060401f8
org.openqa.selenium.TimeoutException: 
Timed out after 5 seconds waiting for org.opennms.smoketest.ClassificationRulePageIT$Page$$Lambda$116/320155726@6878c82c
(6 more lines...)
Collapse Failed ClassificationRestIT verifyClassify History
Smoke Test 12 secs
java.lang.AssertionError: 1 expectation failed.
Expected status code <200> but was <404>.

java.lang.AssertionError: 
1 expectation failed.
Expected status code <200> but was <404>.

	at org.opennms.smoketest.flow.ClassificationRestIT.setEnabled(ClassificationRestIT.java:333)
(1 more lines...)
Collapse Failed ClassificationRestIT verifyCreateNull History
Smoke Test 12 secs
java.lang.AssertionError: 1 expectation failed.
Expected status code <200> but was <404>.

java.lang.AssertionError: 
1 expectation failed.
Expected status code <200> but was <404>.

	at org.opennms.smoketest.flow.ClassificationRestIT.setEnabled(ClassificationRestIT.java:333)
(1 more lines...)
Collapse Failed ClassificationRestIT verifyCRUD History
Smoke Test 12 secs
java.lang.AssertionError: 1 expectation failed.
Expected status code <200> but was <404>.

java.lang.AssertionError: 
1 expectation failed.
Expected status code <200> but was <404>.

	at org.opennms.smoketest.flow.ClassificationRestIT.setEnabled(ClassificationRestIT.java:333)
(1 more lines...)
Collapse Failed ClassificationRestIT verifyGetNonExisting History
Smoke Test 12 secs
java.lang.AssertionError: 1 expectation failed.
Expected status code <200> but was <404>.

java.lang.AssertionError: 
1 expectation failed.
Expected status code <200> but was <404>.

	at org.opennms.smoketest.flow.ClassificationRestIT.setEnabled(ClassificationRestIT.java:333)
(1 more lines...)
Collapse Failed ClassificationRestIT verifyUpdateNonExisting History
Smoke Test 17 secs
java.lang.AssertionError: 1 expectation failed.
Expected status code <200> but was <404>.

java.lang.AssertionError: 
1 expectation failed.
Expected status code <200> but was <404>.

	at org.opennms.smoketest.flow.ClassificationRestIT.setEnabled(ClassificationRestIT.java:333)
(1 more lines...)
Collapse Failed ClassificationRestIT verifyProtocols History
Smoke Test 12 secs
java.lang.AssertionError: 1 expectation failed.
Expected status code <200> but was <404>.

java.lang.AssertionError: 
1 expectation failed.
Expected status code <200> but was <404>.

	at org.opennms.smoketest.flow.ClassificationRestIT.setEnabled(ClassificationRestIT.java:333)
(1 more lines...)
Collapse Failed ClassificationRestIT verifyDeleteNonExisting History
Smoke Test 12 secs
java.lang.AssertionError: 1 expectation failed.
Expected status code <200> but was <404>.

java.lang.AssertionError: 
1 expectation failed.
Expected status code <200> but was <404>.

	at org.opennms.smoketest.flow.ClassificationRestIT.setEnabled(ClassificationRestIT.java:333)
(1 more lines...)
Collapse Failed ClassificationRestIT verifyDisableGroup History
Smoke Test 12 secs
java.lang.AssertionError: 1 expectation failed.
Expected status code <200> but was <404>.

java.lang.AssertionError: 
1 expectation failed.
Expected status code <200> but was <404>.

	at org.opennms.smoketest.flow.ClassificationRestIT.setEnabled(ClassificationRestIT.java:333)
(1 more lines...)
Collapse Failed ClassificationRestIT verifyClassifyEmpty History
Smoke Test 12 secs
java.lang.AssertionError: 1 expectation failed.
Expected status code <200> but was <404>.

java.lang.AssertionError: 
1 expectation failed.
Expected status code <200> but was <404>.

	at org.opennms.smoketest.flow.ClassificationRestIT.setEnabled(ClassificationRestIT.java:333)
(1 more lines...)
Collapse Failed ClassificationRestIT verifyImport History
Smoke Test 12 secs
java.lang.AssertionError: 1 expectation failed.
Expected status code <200> but was <404>.

java.lang.AssertionError: 
1 expectation failed.
Expected status code <200> but was <404>.

	at org.opennms.smoketest.flow.ClassificationRestIT.setEnabled(ClassificationRestIT.java:333)
(1 more lines...)
Collapse Failed ClassificationRestIT verifyExportGroup History
Smoke Test 12 secs
java.lang.AssertionError: 1 expectation failed.
Expected status code <200> but was <404>.

java.lang.AssertionError: 
1 expectation failed.
Expected status code <200> but was <404>.

	at org.opennms.smoketest.flow.ClassificationRestIT.setEnabled(ClassificationRestIT.java:333)
(1 more lines...)
Collapse Failed FlowStackIT verifyFlowStack History
Smoke Test 2 mins
com.jayway.awaitility.core.ConditionTimeoutException: Condition with lambda expression in org.opennms.smoketest.telemetry.FlowTester that uses org.opennms.smoketest.telemetry.FlowTester$Block was not fulfilled within 1 minutes.
	at org.opennms.smoketest.flow.FlowStackIT.verifyFlowStack(FlowStackIT.java:98)
Collapse Failed SinglePortFlowsIT verifyFlowStack History
Smoke Test 2 mins
com.jayway.awaitility.core.ConditionTimeoutException: Condition with lambda expression in org.opennms.smoketest.telemetry.FlowTester that uses org.opennms.smoketest.telemetry.FlowTester$Block was not fulfilled within 1 minutes.
	at org.opennms.smoketest.flow.SinglePortFlowsIT.verifyFlowStack(SinglePortFlowsIT.java:100)
Collapse Failed HealthCheckIT org.opennms.smoketest.health.HealthCheckIT History
Smoke Test 7 mins
com.jayway.awaitility.core.ConditionTimeoutException: Condition with lambda expression in org.opennms.test.system.api.NewTestEnvironment that uses java.net.InetSocketAddress was not fulfilled within 5 minutes.
Collapse Failed IndexPageIT verifyStatusMap History
Smoke Test 2 mins
org.openqa.selenium.TimeoutException: Timed out after 120 seconds waiting for org.opennms.smoketest.IndexPageIT$1@733f1395
Build info: version: '2.53.1', revision: 'a36b8b1cd5757287168e54b817830adce9b0158d', time: '2016-06-30 19:26:09'
System info: host: 'cmu.internal.opennms.com', ip: '172.20.1.203', os.name: 'Linux', os.arch: 'amd64', os.version: '4.18.0-16-generic', java.version: '1.8.0_201'
Driver info: org.openqa.selenium.firefox.FirefoxDriver
Capabilities [{applicationCacheEnabled=true, rotatable=false, handlesAlerts=true, databaseEnabled=true, version=45.0.2, platform=LINUX, nativeEvents=false, acceptSslCerts=true, webStorageEnabled=true, locationContextEnabled=true, browserName=firefox, takesScreenshot=true, javascriptEnabled=true, cssSelectorsEnabled=true}]
Session ID: e8bb9678-55ad-4a95-a568-cdc0075c0049
org.openqa.selenium.TimeoutException: 
Timed out after 120 seconds waiting for org.opennms.smoketest.IndexPageIT$1@733f1395
(6 more lines...)
Collapse Failed IntegrationAPIIT canLoadSampleProject History
Smoke Test 2 mins
com.jayway.awaitility.core.ConditionTimeoutException: Condition with lambda expression in org.opennms.smoketest.IntegrationAPIIT that uses java.net.InetSocketAddress, java.net.InetSocketAddressjava.lang.String was not fulfilled within 2 minutes.
	at org.opennms.smoketest.IntegrationAPIIT.verifyHealthCheckWithDescription(IntegrationAPIIT.java:96)
	at org.opennms.smoketest.IntegrationAPIIT.canLoadSampleProject(IntegrationAPIIT.java:89)
Collapse Failed JmxConfigurationGeneratorIT testNavigation History
Smoke Test 2 mins
org.openqa.selenium.TimeoutException: Timed out after 120 seconds waiting for org.opennms.smoketest.OpenNMSSeleniumTestCase$14@6d3c7ac9
Build info: version: '2.53.1', revision: 'a36b8b1cd5757287168e54b817830adce9b0158d', time: '2016-06-30 19:26:09'
System info: host: 'cmu.internal.opennms.com', ip: '172.20.1.203', os.name: 'Linux', os.arch: 'amd64', os.version: '4.18.0-16-generic', java.version: '1.8.0_201'
Driver info: org.openqa.selenium.firefox.FirefoxDriver
Capabilities [{applicationCacheEnabled=true, rotatable=false, handlesAlerts=true, databaseEnabled=true, version=45.0.2, platform=LINUX, nativeEvents=false, acceptSslCerts=true, webStorageEnabled=true, locationContextEnabled=true, browserName=firefox, takesScreenshot=true, javascriptEnabled=true, cssSelectorsEnabled=true}]
Session ID: ee210ca8-b290-41bf-b3cc-36854c88f3a3
org.openqa.selenium.TimeoutException: 
Timed out after 120 seconds waiting for org.opennms.smoketest.OpenNMSSeleniumTestCase$14@6d3c7ac9
(7 more lines...)
Collapse Failed JmxConfigurationGeneratorIT verifyCompMemberSelection History
Smoke Test 2 mins
org.openqa.selenium.TimeoutException: Timed out after 120 seconds waiting for org.opennms.smoketest.OpenNMSSeleniumTestCase$14@44b5a9cc
Build info: version: '2.53.1', revision: 'a36b8b1cd5757287168e54b817830adce9b0158d', time: '2016-06-30 19:26:09'
System info: host: 'cmu.internal.opennms.com', ip: '172.20.1.203', os.name: 'Linux', os.arch: 'amd64', os.version: '4.18.0-16-generic', java.version: '1.8.0_201'
Driver info: org.openqa.selenium.firefox.FirefoxDriver
Capabilities [{applicationCacheEnabled=true, rotatable=false, handlesAlerts=true, databaseEnabled=true, version=45.0.2, platform=LINUX, nativeEvents=false, acceptSslCerts=true, webStorageEnabled=true, locationContextEnabled=true, browserName=firefox, takesScreenshot=true, javascriptEnabled=true, cssSelectorsEnabled=true}]
Session ID: 9533b528-408a-433f-8460-a8f1b267c22a
org.openqa.selenium.TimeoutException: 
Timed out after 120 seconds waiting for org.opennms.smoketest.OpenNMSSeleniumTestCase$14@44b5a9cc
(7 more lines...)
Collapse Failed JmxConfigurationGeneratorIT testClickOnHeaderLinkWorks History
Smoke Test 2 mins
org.openqa.selenium.NoSuchElementException: Unable to locate element: {"method":"link text","selector":"1. Service Configuration"}
Command duration or timeout: 120.04 seconds
For documentation on this error, please visit: http://seleniumhq.org/exceptions/no_such_element.html
Build info: version: '2.53.1', revision: 'a36b8b1cd5757287168e54b817830adce9b0158d', time: '2016-06-30 19:26:09'
System info: host: 'cmu.internal.opennms.com', ip: '172.20.1.203', os.name: 'Linux', os.arch: 'amd64', os.version: '4.18.0-16-generic', java.version: '1.8.0_201'
Driver info: org.openqa.selenium.firefox.FirefoxDriver
Capabilities [{applicationCacheEnabled=true, rotatable=false, handlesAlerts=true, databaseEnabled=true, version=45.0.2, platform=LINUX, nativeEvents=false, acceptSslCerts=true, webStorageEnabled=true, locationContextEnabled=true, browserName=firefox, takesScreenshot=true, javascriptEnabled=true, cssSelectorsEnabled=true}]
Session ID: 04b3a9ba-8811-4467-9f8c-cf14b0f02948
(18 more lines...)
Collapse Failed KafkaPersisterIT testKafkaPersisterForMetrics History
Smoke Test 2 mins
com.jayway.awaitility.core.ConditionTimeoutException: Lambda expression in org.opennms.smoketest.BaseKafkaPersisterIT: expected a string containing "Persisted collection" but was <
   ____                   _   _ __  __  _____  
  / __ \                 | \ | |  \/  |/ ____| 
 | |  | |_ __   ___ _ __ |  \| | \  / | (___   
 | |  | | '_ \ / _ \ '_ \| . ` | |\/| |\___ \  
 | |__| | |_) |  __/ | | | |\  | |  | |____) | 
  \____/| .__/ \___|_| |_|_| \_|_|  |_|_____/  
        | |                                    
(55 more lines...)
Collapse Failed KafkaProducerIT testKafkaPersisterForMetrics History
Smoke Test 2 mins
com.jayway.awaitility.core.ConditionTimeoutException: Lambda expression in org.opennms.smoketest.BaseKafkaPersisterIT: expected a string containing "Persisted collection" but was <
   ____                   _   _ __  __  _____  
  / __ \                 | \ | |  \/  |/ ____| 
 | |  | |_ __   ___ _ __ |  \| | \  / | (___   
 | |  | | '_ \ / _ \ '_ \| . ` | |\/| |\___ \  
 | |__| | |_) |  __/ | | | |\  | |  | |____) | 
  \____/| .__/ \___|_| |_|_| \_|_|  |_|_____/  
        | |                                    
(57 more lines...)
Collapse Failed KafkaProducerIT testKafkaAlarmStoreData History
Smoke Test 2 mins
com.jayway.awaitility.core.ConditionTimeoutException: Lambda expression in org.opennms.smoketest.KafkaProducerIT: expected a string containing "uei.opennms.org/alarms/trigger:::kafka-producer-test" but was <
Command not found: kafka-producer:list-alarms
admin@opennms> logout
> within 2 minutes.
com.jayway.awaitility.core.ConditionTimeoutException: 
Lambda expression in org.opennms.smoketest.KafkaProducerIT: expected a string containing "uei.opennms.org/alarms/trigger:::kafka-producer-test" but was <

Command not found: kafka-producer:list-alarms
(4 more lines...)
Collapse Failed MenuHeaderIT testMenuEntries History
Smoke Test 2 mins
org.openqa.selenium.TimeoutException: Timed out after 120 seconds waiting for visibility of element located by By.xpath: //span[text()='Surveillance view: default']
Build info: version: '2.53.1', revision: 'a36b8b1cd5757287168e54b817830adce9b0158d', time: '2016-06-30 19:26:09'
System info: host: 'cmu.internal.opennms.com', ip: '172.20.1.203', os.name: 'Linux', os.arch: 'amd64', os.version: '4.18.0-16-generic', java.version: '1.8.0_201'
Driver info: org.openqa.selenium.firefox.FirefoxDriver
Capabilities [{applicationCacheEnabled=true, rotatable=false, handlesAlerts=true, databaseEnabled=true, version=45.0.2, platform=LINUX, nativeEvents=false, acceptSslCerts=true, webStorageEnabled=true, locationContextEnabled=true, browserName=firefox, takesScreenshot=true, javascriptEnabled=true, cssSelectorsEnabled=true}]
Session ID: 0d80ad6f-b843-4bdb-8cd0-3c66c6288926
org.openqa.selenium.TimeoutException: 
Timed out after 120 seconds waiting for visibility of element located by By.xpath: //span[text()='Surveillance view: default']
(23 more lines...)
Collapse Failed CollectorListIT canLoadCollectorsOnOpenNMS History
Smoke Test 3 mins
com.jayway.awaitility.core.ConditionTimeoutException: Lambda expression in org.opennms.smoketest.minion.CollectorListIT: expected a collection with size <0> but was <[org.opennms.netmgt.collectd.SnmpCollector, org.opennms.netmgt.collectd.HttpCollector, org.opennms.netmgt.collectd.JdbcCollector, org.opennms.netmgt.collectd.Jsr160Collector, org.opennms.netmgt.collectd.VmwareCimCollector, org.opennms.netmgt.collectd.VmwareCollector, org.opennms.netmgt.collectd.WmiCollector, org.opennms.netmgt.collectd.WsManCollector, org.opennms.protocols.xml.collector.XmlCollector]> within 3 minutes.
	at org.opennms.smoketest.minion.CollectorListIT.canLoadCollectorsOnOpenNMS(CollectorListIT.java:119)
Collapse Failed DetectorsCommandIT canLoadDetectorsOnOpenNMS History
Smoke Test 3 mins
com.jayway.awaitility.core.ConditionTimeoutException: Lambda expression in org.opennms.smoketest.minion.DetectorsCommandIT: expected a collection with size <0> but was <[BGP_Session, BSF, CITRIX, Cisco_IP_SLA, DHCP, DNS, Dell_OpenManageChassis, DiskUsage, DominoIIOP, FTP, GP, HOST-RESOURCES, HTTP, HTTPS, ICMP, IMAP, IMAPS, JDBC, JSR160, JdbcQueryDetector, JdbcStoredProcedureDetector, LDAP, LDAPS, LOOP, MSExchange, Memcached, NOTES, NRPE, NTP, OMSAStorage, PERC, POP3, SMB, SMTP, SNMP, SSH, TCP, TrivialTime, WEB, WMI, WS-Man, WsManWQLService, Win32Service]> within 3 minutes.
	at org.opennms.smoketest.minion.DetectorsCommandIT.canLoadDetectorsOnOpenNMS(DetectorsCommandIT.java:153)
Collapse Failed JMXCollectorIT canPerformAdhocJmxCollection History
Smoke Test 2 mins
com.jayway.awaitility.core.ConditionTimeoutException: Lambda expression in org.opennms.smoketest.minion.JMXCollectorIT: expected a string containing "java_lang_type_OperatingSystem" but was < -l MINION org.opennms.netmgt.collectd.Jsr160Collector 127.0.0.1 port=18980
logout
admin@opennms> collection:collect -l MINION org.opennms.netmgt.collectd.Jsr160Collector 127.0.0.1 port=18980
Command not found: collection:collect
admin@opennms> logout
> within 3 minutes.
com.jayway.awaitility.core.ConditionTimeoutException: 
Lambda expression in org.opennms.smoketest.minion.JMXCollectorIT: expected a string containing "java_lang_type_OperatingSystem" but was < -l MINION org.opennms.netmgt.collectd.Jsr160Collector 127.0.0.1 port=18980
(8 more lines...)
Collapse Failed JtiTelemetryIT verifyJtiTelemetryOnOpenNMS History
Smoke Test 45 secs
com.jayway.awaitility.core.ConditionTimeoutException: Condition returned by method "matchRrdFileFromNodeResource" in class org.opennms.smoketest.minion.JtiTelemetryIT was not fulfilled within 30 seconds.
	at org.opennms.smoketest.minion.JtiTelemetryIT.verifyJtiTelemetryOnOpenNMS(JtiTelemetryIT.java:151)
Collapse Failed JtiTelemetryIT verifyJtiTelemetryOnMinion History
Smoke Test 2 mins
com.jayway.awaitility.core.ConditionTimeoutException: Condition returned by method "matchRrdFileFromNodeResource" in class org.opennms.smoketest.minion.JtiTelemetryIT was not fulfilled within 2 minutes.
	at org.opennms.smoketest.minion.JtiTelemetryIT.verifyJtiTelemetryOnMinion(JtiTelemetryIT.java:182)
Collapse Failed MonitorsListCommandIT canLoadMonitorsOnOpenNMS History
Smoke Test 2 mins
com.jayway.awaitility.core.ConditionTimeoutException: Lambda expression in org.opennms.smoketest.minion.MonitorsListCommandIT: expected a collection with size <0> but was <[org.opennms.netmgt.poller.monitors.DNSResolutionMonitor, org.opennms.netmgt.poller.monitors.JDBCQueryMonitor, org.opennms.netmgt.poller.monitors.DskTableMonitor, org.opennms.netmgt.poller.monitors.SmbMonitor, org.opennms.netmgt.poller.monitors.HttpMonitor, org.opennms.netmgt.poller.monitors.PercMonitor, org.opennms.netmgt.poller.monitors.HttpsMonitor, org.opennms.netmgt.poller.monitors.SSLCertMonitor, org.opennms.netmgt.poller.monitors.MailTransportMonitor, org.opennms.netmgt.poller.monitors.OpenManageChassisMonitor, org.opennms.netmgt.poller.monitors.BgpSessionMonitor, org.opennms.netmgt.poller.monitors.TcpMonitor, org.opennms.netmgt.poller.monitors.MemcachedMonitor, org.opennms.netmgt.poller.monitors.ImapMonitor, org.opennms.netmgt.poller.monitors.SshMonitor, org.opennms.netmgt.poller.monitors.PageSequenceMonitor, org.opennms.netmgt.poller.monitors.LaTableMonitor, org.opennms.netmgt.poller.monitors.HttpPostMonitor, org.opennms.netmgt.poller.monitors.Jsr160Monitor, org.opennms.netmgt.poller.monitors.LdapsMonitor, org.opennms.netmgt.poller.monitors.ImapsMonitor, org.opennms.netmgt.poller.monitors.DiskUsageMonitor, org.opennms.netmgt.poller.monitors.SystemExecuteMonitor, org.opennms.netmgt.poller.monitors.CitrixMonitor, org.opennms.netmgt.poller.monitors.SmtpMonitor, org.opennms.netmgt.poller.monitors.TrivialTimeMonitor, org.opennms.netmgt.poller.monitors.JolokiaBeanMonitor, org.opennms.netmgt.poller.monitors.LoopMonitor, org.opennms.netmgt.poller.monitors.FtpMonitor, org.opennms.netmgt.poller.monitors.NrpeMonitor, org.opennms.netmgt.poller.monitors.AvailabilityMonitor, org.opennms.netmgt.poller.monitors.LogMatchTableMonitor, org.opennms.netmgt.poller.monitors.Win32ServiceMonitor, org.opennms.netmgt.poller.monitors.NtpMonitor, org.opennms.netmgt.poller.monitors.CiscoPingMibMonitor, org.opennms.netmgt.poller.monitors.StrafePingMonitor, org.opennms.netmgt.poller.monitors.LdapMonitor, org.opennms.netmgt.poller.monitors.Pop3Monitor, org.opennms.netmgt.poller.monitors.DominoIIOPMonitor, org.opennms.netmgt.poller.monitors.DnsMonitor, org.opennms.netmgt.poller.monitors.SnmpMonitor, org.opennms.netmgt.poller.monitors.PrTableMonitor, org.opennms.netmgt.poller.monitors.IcmpMonitor, org.opennms.netmgt.poller.monitors.JDBCMonitor, org.opennms.netmgt.poller.monitors.JDBCStoredProcedureMonitor, org.opennms.netmgt.poller.monitors.BSFMonitor, org.opennms.netmgt.poller.monitors.OmsaStorageMonitor, org.opennms.netmgt.poller.monitors.HostResourceSwRunMonitor, org.opennms.netmgt.poller.monitors.NetScalerGroupHealthMonitor, org.opennms.netmgt.poller.monitors.WebMonitor, org.opennms.netmgt.poller.monitors.CiscoIpSlaMonitor, org.opennms.netmgt.poller.monitors.VmwareMonitor, org.opennms.netmgt.poller.monitors.VmwareCimMonitor, org.opennms.netmgt.poller.monitors.WsManMonitor, org.opennms.netmgt.poller.monitors.DhcpMonitor]> within 3 minutes.
	at org.opennms.smoketest.minion.MonitorsListCommandIT.canLoadMonitorsOnOpenNMS(MonitorsListCommandIT.java:153)
Collapse Failed NxosTelemetryIT verifyNxosTelemetryOnMinion History
Smoke Test 2 mins
com.jayway.awaitility.core.ConditionTimeoutException: Condition returned by method "matchRrdFileFromNodeResource" in class org.opennms.smoketest.minion.NxosTelemetryIT was not fulfilled within 2 minutes.
	at org.opennms.smoketest.minion.NxosTelemetryIT.verifyNxosTelemetryOnMinion(NxosTelemetryIT.java:162)
Collapse Failed NxosTelemetryIT verifyNxosTelemetryOnOpenNMS History
Smoke Test 1 min
com.jayway.awaitility.core.ConditionTimeoutException: Condition returned by method "matchRrdFileFromNodeResource" in class org.opennms.smoketest.minion.NxosTelemetryIT was not fulfilled within 30 seconds.
	at org.opennms.smoketest.minion.NxosTelemetryIT.verifyNxosTelemetryOnOpenNMS(NxosTelemetryIT.java:132)
Collapse Failed RpcOverKafkaIT verifyKafkaRpcWithJdbcServiceDetection History
Smoke Test 3 mins
com.jayway.awaitility.core.ConditionTimeoutException: Lambda expression in org.opennms.smoketest.minion.RpcOverKafkaIT: expected a string containing "'JDBC' WAS detected" but was < 172.17.0.3 url=jdbc:postgresql://172.17.0.3:5432/opennms
Command not found: detect
admin@opennms> logout
> within 3 minutes.
com.jayway.awaitility.core.ConditionTimeoutException: 
Lambda expression in org.opennms.smoketest.minion.RpcOverKafkaIT: expected a string containing "'JDBC' WAS detected" but was < 172.17.0.3 url=jdbc:postgresql://172.17.0.3:5432/opennms

Command not found: detect
(4 more lines...)
Collapse Failed RpcOverKafkaIT verifyKafkaRpcWithIcmpServiceDetection History
Smoke Test 3 mins
com.jayway.awaitility.core.ConditionTimeoutException: Lambda expression in org.opennms.smoketest.minion.RpcOverKafkaIT: expected a string containing "'ICMP' WAS detected on 127.0.0.1" but was <
Command not found: detect
admin@opennms> logout
> within 3 minutes.
com.jayway.awaitility.core.ConditionTimeoutException: 
Lambda expression in org.opennms.smoketest.minion.RpcOverKafkaIT: expected a string containing "'ICMP' WAS detected on 127.0.0.1" but was <

Command not found: detect
(4 more lines...)
Collapse Failed SyslogKafkaElasticsearch5IT testMinionSyslogsOverKafkaToEsRest History
Smoke Test 8 mins
com.jayway.awaitility.core.ConditionTimeoutException: Condition with lambda expression in org.opennms.smoketest.minion.AbstractSyslogTestCase that uses java.util.function.Supplier, java.util.function.Supplierjava.util.function.Supplier, java.util.function.Supplierint was not fulfilled within 5 minutes.
	at org.opennms.smoketest.minion.SyslogKafkaElasticsearch5IT.testMinionSyslogsOverKafkaToEsRest(SyslogKafkaElasticsearch5IT.java:139)
Collapse Failed SyslogKafkaElasticsearch5OutageIT testMinionSyslogsOverKafkaToEsRest History
Smoke Test 9 mins
com.jayway.awaitility.core.ConditionTimeoutException: Condition with lambda expression in org.opennms.smoketest.minion.AbstractSyslogTestCase that uses java.util.function.Supplier, java.util.function.Supplierjava.util.function.Supplier, java.util.function.Supplierint was not fulfilled within 5 minutes.
	at org.opennms.smoketest.minion.SyslogKafkaElasticsearch5OutageIT.testMinionSyslogsOverKafkaToEsRest(SyslogKafkaElasticsearch5OutageIT.java:173)
Collapse Failed SyslogKafkaElasticsearch6IT testMinionSyslogsOverKafkaToEsRest History
Smoke Test 8 mins
com.jayway.awaitility.core.ConditionTimeoutException: Condition with lambda expression in org.opennms.smoketest.minion.AbstractSyslogTestCase that uses java.util.function.Supplier, java.util.function.Supplierjava.util.function.Supplier, java.util.function.Supplierint was not fulfilled within 5 minutes.
	at org.opennms.smoketest.minion.SyslogKafkaElasticsearch6IT.testMinionSyslogsOverKafkaToEsRest(SyslogKafkaElasticsearch6IT.java:139)
Collapse Failed SyslogKafkaElasticsearchBufferingIT testMinionSyslogsOverKafkaToEsRest History
Smoke Test 9 mins
com.jayway.awaitility.core.ConditionTimeoutException: Condition with lambda expression in org.opennms.smoketest.minion.AbstractSyslogTestCase that uses java.util.function.Supplier, java.util.function.Supplierjava.util.function.Supplier, java.util.function.Supplierint was not fulfilled within 5 minutes.
	at org.opennms.smoketest.minion.SyslogKafkaElasticsearchBufferingIT.testMinionSyslogsOverKafkaToEsRest(SyslogKafkaElasticsearchBufferingIT.java:180)

Jira issues

IssueDescriptionStatus
Unknown Issue TypeNMS-10609Could not obtain issue details from Jira