Build #33

Build: #33 failed Rebuilt by Benjamin Reed

Build result summary

Details

Completed
Duration
688 minutes
Labels
None
Revisions
OpenNMS (develop branch)
76f772faf39835e5989b263e96b24a4f4e227dd1 76f772faf39835e5989b263e96b24a4f4e227dd1
OpenNMS Installer
da12784d9ab4ba4aacedec0283d0c04075fd6ebf da12784d9ab4ba4aacedec0283d0c04075fd6ebf
OpenNMS-Repo
088d710674109759251f42c6720d74ea80cf3f13 088d710674109759251f42c6720d74ea80cf3f13
Smoke Tests
cb1e72265cf2ce10cb4872f58120272b340a1ce1 cb1e72265cf2ce10cb4872f58120272b340a1ce1
OpenNMS Bamboo Utils
a6d144f81c2df6f267b94e79328a0c8497980837 a6d144f81c2df6f267b94e79328a0c8497980837
OpenNMS System Test API
2baceb98eba956ca0f62f0e2d469d9f73b7ffd02 2baceb98eba956ca0f62f0e2d469d9f73b7ffd02
Total tests
6274
Failing since
#31 (Changes by mvrueden <mvrueden@users.noreply.github.com>)
Fixed in
#34 (Changes by Christian Pape and Jesse White)
Number of retries
1

Responsible

This build has been failing since #31
No one has taken responsibility

Branch integration details

Checked out
release-23.0.2 877f2e73673a24f90653a0327a43f0c0adb766d4
Merged with
foundation-2018 76f772faf39835e5989b263e96b24a4f4e227dd1 76f772faf39835e5989b263e96b24a4f4e227dd1

Code commits

OpenNMS System Test API
Author Commit Message Commit date
Benjamin Reed Benjamin Reed 2baceb98eba956ca0f62f0e2d469d9f73b7ffd02 2baceb98eba956ca0f62f0e2d469d9f73b7ffd02 Revert "wrap yum with a tool that attempts to use internal caching mirror if possible"
This reverts commit f09541a2807db375b73ddf8b54fc1f430cdf43f4.
Benjamin Reed Benjamin Reed f49bcb0fc5b7e8003aecb6ece66f88bbf42d001c f49bcb0fc5b7e8003aecb6ece66f88bbf42d001c Revert "disable for now, proxy server is not stable :("
This reverts commit f2896c05afb81385b8a4c52331fb67956d2985a6.
Benjamin Reed Benjamin Reed f2896c05afb81385b8a4c52331fb67956d2985a6 f2896c05afb81385b8a4c52331fb67956d2985a6 disable for now, proxy server is not stable :(

Tests

New test failures 1
Status Test View job Duration
Collapse Failed HttpDataCollectionIT testPostRequestHttpCollection History
Integration Test < 1 sec
junit.framework.AssertionFailedError: Log messages at or greater than the log level WARN received:
 [WARN] org.eclipse.jetty.util.resource.Resource: java.lang.IllegalArgumentException: URI has a query component
 [WARN] org.eclipse.jetty.util.resource.Resource: java.lang.IllegalArgumentException: URI has a query component
junit.framework.AssertionFailedError: Log messages at or greater than the log level WARN received:
	[WARN] org.eclipse.jetty.util.resource.Resource: java.lang.IllegalArgumentException: URI has a query component
	[WARN] org.eclipse.jetty.util.resource.Resource: java.lang.IllegalArgumentException: URI has a query component
	at org.opennms.core.test.MockLogAppender.assertNotGreaterOrEqual(MockLogAppender.java:282)
	at org.opennms.core.test.MockLogAppender.assertNoWarningsOrGreater(MockLogAppender.java:291)
(1 more lines...)
Existing test failures 7
Status Test Failing since View job Duration
com.jayway.awaitility.core.ConditionTimeoutException: Condition with lambda expression in org.opennms.smoketest.health.HealthCheckIT was not fulfilled within 5 minutes.
	at org.opennms.smoketest.health.HealthCheckIT.verifyHealthCheck(HealthCheckIT.java:126)
	at org.opennms.smoketest.health.HealthCheckIT.verifySentinelHealth(HealthCheckIT.java:118)
com.jayway.awaitility.core.ConditionTimeoutException: Condition with lambda expression in org.opennms.smoketest.sentinel.DaoIT was not fulfilled within 5 minutes.
	at org.opennms.smoketest.sentinel.DaoIT.verifyDaos(DaoIT.java:96)
com.jayway.awaitility.core.ConditionTimeoutException: Condition with lambda expression in org.opennms.smoketest.sentinel.AbstractFlowIT was not fulfilled within 5 minutes.
com.jayway.awaitility.core.ConditionTimeoutException: Condition with lambda expression in org.opennms.smoketest.sentinel.AbstractFlowIT was not fulfilled within 5 minutes.
com.jayway.awaitility.core.ConditionTimeoutException: Condition with lambda expression in org.opennms.smoketest.utils.KarafShell was not fulfilled within 5 minutes.
com.jayway.awaitility.core.ConditionTimeoutException: Condition with lambda expression in org.opennms.smoketest.utils.KarafShell was not fulfilled within 5 minutes.
com.jayway.awaitility.core.ConditionTimeoutException: Condition with lambda expression in org.opennms.smoketest.utils.KarafShell was not fulfilled within 5 minutes.