Build #32

Build: #32 failed Changes by Bamboo Administrator and Benjamin Reed

Build result summary

Details

Completed
Duration
627 minutes
Labels
None
Revisions
OpenNMS (develop branch)
76f772faf39835e5989b263e96b24a4f4e227dd1 76f772faf39835e5989b263e96b24a4f4e227dd1
OpenNMS Installer
da12784d9ab4ba4aacedec0283d0c04075fd6ebf da12784d9ab4ba4aacedec0283d0c04075fd6ebf
OpenNMS-Repo
088d710674109759251f42c6720d74ea80cf3f13 088d710674109759251f42c6720d74ea80cf3f13
Smoke Tests
cb1e72265cf2ce10cb4872f58120272b340a1ce1 cb1e72265cf2ce10cb4872f58120272b340a1ce1
OpenNMS Bamboo Utils
a6d144f81c2df6f267b94e79328a0c8497980837 a6d144f81c2df6f267b94e79328a0c8497980837
OpenNMS System Test API
f09541a2807db375b73ddf8b54fc1f430cdf43f4 f09541a2807db375b73ddf8b54fc1f430cdf43f4
Total tests
8090
Failing since
#31 (Changes by mvrueden <mvrueden@users.noreply.github.com>)
Fixed in
#34 (Changes by Christian Pape and Jesse White)

Tests

Responsible

This build has been failing since #31
No one has taken responsibility

Branch integration details

Checked out
release-23.0.2 877f2e73673a24f90653a0327a43f0c0adb766d4
Merged with
foundation-2018 76f772faf39835e5989b263e96b24a4f4e227dd1 76f772faf39835e5989b263e96b24a4f4e227dd1

Code commits

OpenNMS (develop branch)
Author Commit Message Commit date
Bamboo Administrator Bamboo Administrator 76f772faf39835e5989b263e96b24a4f4e227dd1 76f772faf39835e5989b263e96b24a4f4e227dd1 [bamboo] Automated branch merge (from foundation-2017:7d8a3674068023f3e52fcfad5a51a41627698c26)
Benjamin Reed Benjamin Reed 7d8a3674068023f3e52fcfad5a51a41627698c26 m 7d8a3674068023f3e52fcfad5a51a41627698c26 Merge remote-tracking branch 'origin/foundation-2016' into foundation-2017
Ronny Trommer Ronny Trommer b906179c988085207d80d6870087748af381fb04 m b906179c988085207d80d6870087748af381fb04 Merge pull request #2218 from OpenNMS/jira/HZN-157
HZN-157: SmtpMonitor documentation
Ronny Trommer Ronny Trommer 5ca4c298740b86c7b2ca1d731528834299ceb434 m 5ca4c298740b86c7b2ca1d731528834299ceb434 HZN-157: Fix copy paste typo
Jeff Gehlbach Jeff Gehlbach 2598479d3786defedc2209a74c76697b3b56ab8a m 2598479d3786defedc2209a74c76697b3b56ab8a HZN-157: SmtpMonitor documentation

Tests

New test failures 8
Status Test View job Duration
Collapse Failed HealthCheckIT verifySentinelHealth History
Smoke Test 5 mins
com.jayway.awaitility.core.ConditionTimeoutException: Condition with lambda expression in org.opennms.smoketest.health.HealthCheckIT was not fulfilled within 5 minutes.
	at org.opennms.smoketest.health.HealthCheckIT.verifyHealthCheck(HealthCheckIT.java:126)
	at org.opennms.smoketest.health.HealthCheckIT.verifySentinelHealth(HealthCheckIT.java:118)
Collapse Failed JtiTelemetryIT org.opennms.smoketest.minion.JtiTelemetryIT History
Smoke Test 5 mins
com.jayway.awaitility.core.ConditionTimeoutException: org.opennms.test.system.api.NewTestEnvironment.waitForOpenNMS Callable expected not null but was <null> within 5 minutes.
Collapse Failed DaoIT verifyDaos History
Smoke Test 6 mins
com.jayway.awaitility.core.ConditionTimeoutException: Condition with lambda expression in org.opennms.smoketest.sentinel.DaoIT was not fulfilled within 5 minutes.
	at org.opennms.smoketest.sentinel.DaoIT.verifyDaos(DaoIT.java:96)
Collapse Failed FlowStackJmsIT verifyFlowStack History
Smoke Test 7 mins
com.jayway.awaitility.core.ConditionTimeoutException: Condition with lambda expression in org.opennms.smoketest.sentinel.AbstractFlowIT was not fulfilled within 5 minutes.
Collapse Failed FlowStackKafkaIT verifyFlowStack History
Smoke Test 7 mins
com.jayway.awaitility.core.ConditionTimeoutException: Condition with lambda expression in org.opennms.smoketest.sentinel.AbstractFlowIT was not fulfilled within 5 minutes.
Collapse Failed JtiTelemetryAdapterIT verifyAdapter History
Smoke Test 8 mins
com.jayway.awaitility.core.ConditionTimeoutException: Condition with lambda expression in org.opennms.smoketest.utils.KarafShell was not fulfilled within 5 minutes.
Collapse Failed NxosTelemetryAdapterIT verifyAdapter History
Smoke Test 8 mins
com.jayway.awaitility.core.ConditionTimeoutException: Condition with lambda expression in org.opennms.smoketest.utils.KarafShell was not fulfilled within 5 minutes.
Collapse Failed SFlowTelemetryAdapterIT verifyAdapter History
Smoke Test 8 mins
com.jayway.awaitility.core.ConditionTimeoutException: Condition with lambda expression in org.opennms.smoketest.utils.KarafShell was not fulfilled within 5 minutes.

Jira issues

IssueDescriptionStatus
Unknown Issue TypeHZN-157Could not obtain issue details from Jira