Build #1,473

Build: #1473 failed

Job: Smoke Test failed

Test results

  • 173 tests in total
  • 10 tests failed
  • 10 failures are new
  • 56 tests were fixed
  • 5 tests were quarantined / skipped
  • 181 minutes taken in total.

Build 1,473 has the following 10 errors: 10 new failure(s) occurred since the previous build.

New test failures 10
Status Test Duration
Collapse Failed ChooseResourcesPageIT org.opennms.smoketest.ChooseResourcesPageIT History
3 mins
com.jayway.awaitility.core.ConditionTimeoutException: Condition returned by method "canConnectViaSsh" in class org.opennms.test.system.api.utils.SshClient was not fulfilled within 2 minutes.
Collapse Failed DatabaseReportBatchIT org.opennms.smoketest.DatabaseReportBatchIT History
3 mins
com.jayway.awaitility.core.ConditionTimeoutException: Condition returned by method "canConnectViaSsh" in class org.opennms.test.system.api.utils.SshClient was not fulfilled within 2 minutes.
Collapse Failed ForecastIT org.opennms.smoketest.ForecastIT History
3 mins
com.jayway.awaitility.core.ConditionTimeoutException: Condition returned by method "canConnectViaSsh" in class org.opennms.test.system.api.utils.SshClient was not fulfilled within 2 minutes.
Collapse Failed KafkaProducerIT org.opennms.smoketest.KafkaProducerIT History
4 mins
com.jayway.awaitility.core.ConditionTimeoutException: Condition returned by method "canConnectViaSsh" in class org.opennms.test.system.api.utils.SshClient was not fulfilled within 2 minutes.
Collapse Failed NotifdIT org.opennms.smoketest.NotifdIT History
3 mins
com.jayway.awaitility.core.ConditionTimeoutException: Condition returned by method "canConnectViaSsh" in class org.opennms.test.system.api.utils.SshClient was not fulfilled within 2 minutes.
Collapse Failed StatisticsReportsIT org.opennms.smoketest.StatisticsReportsIT History
3 mins
com.jayway.awaitility.core.ConditionTimeoutException: Condition returned by method "canConnectViaSsh" in class org.opennms.test.system.api.utils.SshClient was not fulfilled within 2 minutes.
Collapse Failed ClassificationRestIT org.opennms.smoketest.flow.ClassificationRestIT History
3 mins
com.jayway.awaitility.core.ConditionTimeoutException: Condition returned by method "canConnectViaSsh" in class org.opennms.test.system.api.utils.SshClient was not fulfilled within 2 minutes.
Collapse Failed DetectorsCommandIT org.opennms.smoketest.minion.DetectorsCommandIT History
4 mins
com.jayway.awaitility.core.ConditionTimeoutException: Condition returned by method "canConnectViaSsh" in class org.opennms.test.system.api.utils.SshClient was not fulfilled within 2 minutes.
Collapse Failed DetectorsOnMinionIT org.opennms.smoketest.minion.DetectorsOnMinionIT History
4 mins
com.jayway.awaitility.core.ConditionTimeoutException: Condition returned by method "canConnectViaSsh" in class org.opennms.test.system.api.utils.SshClient was not fulfilled within 2 minutes.
Collapse Failed MonitorsListCommandIT org.opennms.smoketest.minion.MonitorsListCommandIT History
4 mins
com.jayway.awaitility.core.ConditionTimeoutException: Condition returned by method "canConnectViaSsh" in class org.opennms.test.system.api.utils.SshClient was not fulfilled within 2 minutes.