Build #1,626

Build: #1626 failed Changes by Bamboo Administrator

Build result summary

Details

Completed
Duration
693 minutes
Labels
None
Revisions
OpenNMS (develop branch)
775af46ce62feb01a6e886232f3c0b73eb5f5ce7 775af46ce62feb01a6e886232f3c0b73eb5f5ce7
OpenNMS Installer
da12784d9ab4ba4aacedec0283d0c04075fd6ebf da12784d9ab4ba4aacedec0283d0c04075fd6ebf
OpenNMS-Repo
088d710674109759251f42c6720d74ea80cf3f13 088d710674109759251f42c6720d74ea80cf3f13
Smoke Tests
cb1e72265cf2ce10cb4872f58120272b340a1ce1 cb1e72265cf2ce10cb4872f58120272b340a1ce1
OpenNMS Bamboo Utils
a6d144f81c2df6f267b94e79328a0c8497980837 a6d144f81c2df6f267b94e79328a0c8497980837
OpenNMS System Test API
2baceb98eba956ca0f62f0e2d469d9f73b7ffd02 2baceb98eba956ca0f62f0e2d469d9f73b7ffd02
Total tests
8001
Fixed in
#1627 (Changes by Benjamin Reed)

Tests

Responsible

Code commits

OpenNMS (develop branch)
Author Commit Message Commit date
Bamboo Administrator Bamboo Administrator 775af46ce62feb01a6e886232f3c0b73eb5f5ce7 775af46ce62feb01a6e886232f3c0b73eb5f5ce7 [bamboo] Automated branch merge (from release-23.0.3:ee5b461a953bf6147c4bd12bc1e5eaea3d60ba4e)
Benjamin Reed Benjamin Reed ee5b461a953bf6147c4bd12bc1e5eaea3d60ba4e m ee5b461a953bf6147c4bd12bc1e5eaea3d60ba4e Merge remote-tracking branch 'origin/foundation-2018' into release-23.0.3
Jesse White Jesse White 2450e463ae688aec14d1ff49ab1893f06889dda3 m 2450e463ae688aec14d1ff49ab1893f06889dda3 Merge pull request #2347 from OpenNMS/mbrooks/NMS-10547
NMS-10547: Default X-Frame-Options
Bamboo Administrator Bamboo Administrator c097a4d8a4a7f8c7dd7f8a59b2433174d3aacb88 m c097a4d8a4a7f8c7dd7f8a59b2433174d3aacb88 [bamboo] Automated branch merge (from foundation-2017:93a6f885e29348de1bc036c17877928bda933e41)
Matthew Brooks <matt@opennms.com> Matthew Brooks <matt@opennms.com> 6a886a06f270f41186b1e25d6a3cee0652d75b67 m 6a886a06f270f41186b1e25d6a3cee0652d75b67 Use 'SAMEORIGIN' instead of 'DENY' to avoid breaking existing tests

Tests

New test failures 2
Status Test View job Duration
Collapse Failed JmxConfigurationGeneratorIT verifyCompMemberSelection History
Smoke Test 2 mins
org.openqa.selenium.TimeoutException: Timed out after 120 seconds waiting for org.opennms.smoketest.OpenNMSSeleniumTestCase$3@316bf926
Build info: version: '2.53.1', revision: 'a36b8b1cd5757287168e54b817830adce9b0158d', time: '2016-06-30 19:26:09'
System info: host: 'bambooagent01.internal.opennms.com', ip: '172.20.1.213', os.name: 'Linux', os.arch: 'amd64', os.version: '4.15.0-45-generic', java.version: '1.8.0_201'
Driver info: org.openqa.selenium.firefox.FirefoxDriver
Capabilities [{applicationCacheEnabled=true, rotatable=false, handlesAlerts=true, databaseEnabled=true, version=45.0.2, platform=LINUX, nativeEvents=false, acceptSslCerts=true, webStorageEnabled=true, locationContextEnabled=true, browserName=firefox, takesScreenshot=true, javascriptEnabled=true, cssSelectorsEnabled=true}]
Session ID: 253c7de8-2608-4660-bd67-84ce545a8584
org.openqa.selenium.TimeoutException: 
Timed out after 120 seconds waiting for org.opennms.smoketest.OpenNMSSeleniumTestCase$3@316bf926
(6 more lines...)
Collapse Failed OpsBoardAdminPageIT canCreateAndUseDeepLink History
Smoke Test 2 mins
org.openqa.selenium.TimeoutException: Timed out after 120 seconds waiting for org.opennms.smoketest.OpenNMSSeleniumTestCase$3@ebbe9f3
Build info: version: '2.53.1', revision: 'a36b8b1cd5757287168e54b817830adce9b0158d', time: '2016-06-30 19:26:09'
System info: host: 'bambooagent01.internal.opennms.com', ip: '172.20.1.213', os.name: 'Linux', os.arch: 'amd64', os.version: '4.15.0-45-generic', java.version: '1.8.0_201'
Driver info: org.openqa.selenium.firefox.FirefoxDriver
Capabilities [{applicationCacheEnabled=true, rotatable=false, handlesAlerts=true, databaseEnabled=true, version=45.0.2, platform=LINUX, nativeEvents=false, acceptSslCerts=true, webStorageEnabled=true, locationContextEnabled=true, browserName=firefox, takesScreenshot=true, javascriptEnabled=true, cssSelectorsEnabled=true}]
Session ID: 7606f552-56e8-4b1e-8910-a5f3a8cdd13e
org.openqa.selenium.TimeoutException: 
Timed out after 120 seconds waiting for org.opennms.smoketest.OpenNMSSeleniumTestCase$3@ebbe9f3
(6 more lines...)

Jira issues

IssueDescriptionStatus
Unknown Issue TypeNMS-10486Could not obtain issue details from Jira
Unknown Issue TypeNMS-10546Could not obtain issue details from Jira
Unknown Issue TypeNMS-10547Could not obtain issue details from Jira