Build #1,473

Build: #1473 failed Rebuilt by Jesse White

Build result summary

Details

Completed
Duration
230 minutes
Labels
None
Revisions
OpenNMS (develop branch)
66b7eab12d4c0ecc5d3ee37e44a65e1489cba3f0 66b7eab12d4c0ecc5d3ee37e44a65e1489cba3f0
OpenNMS Installer
da12784d9ab4ba4aacedec0283d0c04075fd6ebf da12784d9ab4ba4aacedec0283d0c04075fd6ebf
OpenNMS-Repo
f5acfe3b3717db0f16e736d0f0b9ef0c9738b0cd f5acfe3b3717db0f16e736d0f0b9ef0c9738b0cd
Smoke Tests
cb1e72265cf2ce10cb4872f58120272b340a1ce1 cb1e72265cf2ce10cb4872f58120272b340a1ce1
OpenNMS Bamboo Utils
c5b0514a984dd599487469d47e6a69527d55515a c5b0514a984dd599487469d47e6a69527d55515a
OpenNMS System Test API
8add75059247ca77047f45bb0b36a6f1f069bbf3 8add75059247ca77047f45bb0b36a6f1f069bbf3
Total tests
7988
Failing since
#1470 (Rebuilt by Benjamin Reed)
Fixed in
#1476 (Changes by Chandra Gorantla <chandra@opennms.com> and DavidSmith <38085611+smith-opennms@users.noreply.github.com>)
Number of retries
2

Responsible

This build has been failing since #1470
No one has taken responsibility

Code commits

OpenNMS (develop branch)
Author Commit Message Commit date
Chandra Gorantla <chandra@opennms.com> Chandra Gorantla <chandra@opennms.com> 66b7eab12d4c0ecc5d3ee37e44a65e1489cba3f0 66b7eab12d4c0ecc5d3ee37e44a65e1489cba3f0 nms-10306: add missing feature

Tests

New test failures 10
Status Test View job Duration
Collapse Failed ChooseResourcesPageIT org.opennms.smoketest.ChooseResourcesPageIT History
Smoke Test 3 mins
com.jayway.awaitility.core.ConditionTimeoutException: Condition returned by method "canConnectViaSsh" in class org.opennms.test.system.api.utils.SshClient was not fulfilled within 2 minutes.
Collapse Failed DatabaseReportBatchIT org.opennms.smoketest.DatabaseReportBatchIT History
Smoke Test 3 mins
com.jayway.awaitility.core.ConditionTimeoutException: Condition returned by method "canConnectViaSsh" in class org.opennms.test.system.api.utils.SshClient was not fulfilled within 2 minutes.
Collapse Failed ClassificationRestIT org.opennms.smoketest.flow.ClassificationRestIT History
Smoke Test 3 mins
com.jayway.awaitility.core.ConditionTimeoutException: Condition returned by method "canConnectViaSsh" in class org.opennms.test.system.api.utils.SshClient was not fulfilled within 2 minutes.
Collapse Failed ForecastIT org.opennms.smoketest.ForecastIT History
Smoke Test 3 mins
com.jayway.awaitility.core.ConditionTimeoutException: Condition returned by method "canConnectViaSsh" in class org.opennms.test.system.api.utils.SshClient was not fulfilled within 2 minutes.
Collapse Failed KafkaProducerIT org.opennms.smoketest.KafkaProducerIT History
Smoke Test 4 mins
com.jayway.awaitility.core.ConditionTimeoutException: Condition returned by method "canConnectViaSsh" in class org.opennms.test.system.api.utils.SshClient was not fulfilled within 2 minutes.
Collapse Failed DetectorsCommandIT org.opennms.smoketest.minion.DetectorsCommandIT History
Smoke Test 4 mins
com.jayway.awaitility.core.ConditionTimeoutException: Condition returned by method "canConnectViaSsh" in class org.opennms.test.system.api.utils.SshClient was not fulfilled within 2 minutes.
Collapse Failed DetectorsOnMinionIT org.opennms.smoketest.minion.DetectorsOnMinionIT History
Smoke Test 4 mins
com.jayway.awaitility.core.ConditionTimeoutException: Condition returned by method "canConnectViaSsh" in class org.opennms.test.system.api.utils.SshClient was not fulfilled within 2 minutes.
Collapse Failed MonitorsListCommandIT org.opennms.smoketest.minion.MonitorsListCommandIT History
Smoke Test 4 mins
com.jayway.awaitility.core.ConditionTimeoutException: Condition returned by method "canConnectViaSsh" in class org.opennms.test.system.api.utils.SshClient was not fulfilled within 2 minutes.
Collapse Failed NotifdIT org.opennms.smoketest.NotifdIT History
Smoke Test 3 mins
com.jayway.awaitility.core.ConditionTimeoutException: Condition returned by method "canConnectViaSsh" in class org.opennms.test.system.api.utils.SshClient was not fulfilled within 2 minutes.
Collapse Failed StatisticsReportsIT org.opennms.smoketest.StatisticsReportsIT History
Smoke Test 3 mins
com.jayway.awaitility.core.ConditionTimeoutException: Condition returned by method "canConnectViaSsh" in class org.opennms.test.system.api.utils.SshClient was not fulfilled within 2 minutes.
Fixed tests 57
Status Test Failing since View job Duration
Successful OnmsFeatureKarafIT testInstallFeatureOpennmsEventsCommands History
Failing since build #1471 (Changes by Jesse White) Integration Test 6 secs
Successful AdminPageIT testAllLinks History
Failing since build #1471 (Changes by Jesse White) Smoke Test 37 secs
Successful AlarmElasticsearch5IT canForwardAlarmToEs History
Failing since build #1471 (Changes by Jesse White) Smoke Test 14 secs
Successful ClassificationRulePageIT verifyRulePaginationAndDeleteAll History
Failing since build #1471 (Changes by Jesse White) Smoke Test 2 mins
Successful ClassificationRulePageIT verifySrcValues History
Failing since build #1471 (Changes by Jesse White) Smoke Test 30 secs
Successful ClassificationRulePageIT verifyExporterFilter History
Failing since build #1471 (Changes by Jesse White) Smoke Test 32 secs
Successful ClassificationRulePageIT verifyTabs History
Failing since build #1471 (Changes by Jesse White) Smoke Test 27 secs
Successful ClassificationRulePageIT verifyClassification History
Failing since build #1471 (Changes by Jesse White) Smoke Test 23 secs
Successful ClassificationRulePageIT verifySettingsTab History
Failing since build #1471 (Changes by Jesse White) Smoke Test 41 secs
Successful ClassificationRulePageIT verifyReadOnlyGroup History
Failing since build #1471 (Changes by Jesse White) Smoke Test 43 secs
Successful ClassificationRulePageIT verifySearch History
Failing since build #1471 (Changes by Jesse White) Smoke Test 22 secs
Successful ClassificationRulePageIT verifyRuleCRUD History
Failing since build #1471 (Changes by Jesse White) Smoke Test 30 secs
Successful ClassificationRulePageIT verifyErrorMessageReset History
Failing since build #1471 (Changes by Jesse White) Smoke Test 24 secs
Successful FlowStackIT verifyFlowStack History
Failing since build #1471 (Changes by Jesse White) Smoke Test 3 mins
Successful HealthCheckIT verifyOpenNMSHealth History
Failing since build #1471 (Changes by Jesse White) Smoke Test 10 secs
Successful IndexPageIT verifyStatusMap History
Failing since build #1471 (Changes by Jesse White) Smoke Test 21 secs
Successful JmxConfigurationGeneratorIT verifyCompMemberSelection History
Failing since build #1471 (Changes by Jesse White) Smoke Test 25 secs
Successful JmxConfigurationGeneratorIT testClickOnHeaderLinkWorks History
Failing since build #1471 (Changes by Jesse White) Smoke Test 19 secs
Successful JmxConfigurationGeneratorIT testNavigation History
Failing since build #1471 (Changes by Jesse White) Smoke Test 27 secs
Successful KafkaPersisterIT testKafkaPersisterForMetrics History
Failing since build #1471 (Changes by Jesse White) Smoke Test 51 secs
Successful MenuHeaderIT testMenuEntries History
Failing since build #1471 (Changes by Jesse White) Smoke Test 34 secs
Successful CollectorListIT canLoadCollectorsOnOpenNMS History
Failing since build #1471 (Changes by Jesse White) Smoke Test < 1 sec
Successful JMXCollectorIT canPerformAdhocJmxCollection History
Failing since build #1471 (Changes by Jesse White) Smoke Test < 1 sec
Successful JtiTelemetryIT verifyJtiTelemetryOnMinion History
Failing since build #1471 (Changes by Jesse White) Smoke Test 30 secs
Successful JtiTelemetryIT verifyJtiTelemetryOnOpenNMS History
Failing since build #1471 (Changes by Jesse White) Smoke Test 20 secs
Successful NxosTelemetryIT verifyNxosTelemetryOnMinion History
Failing since build #1471 (Changes by Jesse White) Smoke Test 45 secs
Successful NxosTelemetryIT verifyNxosTelemetryOnOpenNMS History
Failing since build #1471 (Changes by Jesse White) Smoke Test 35 secs
Successful RpcOverKafkaIT verifyKafkaRpcWithIcmpServiceDetection History
Failing since build #1471 (Changes by Jesse White) Smoke Test 15 secs
Successful SyslogKafkaElasticsearchBufferingIT testMinionSyslogsOverKafkaToEsRest History
Failing since build #1471 (Changes by Jesse White) Smoke Test 9 mins
Successful NodeDetailPageIT canUseViewInTopology History
Failing since build #1471 (Changes by Jesse White) Smoke Test 21 secs
Successful OpsBoardAdminPageIT canCreateAndPreview History
Failing since build #1471 (Changes by Jesse White) Smoke Test 29 secs
Successful OsgiDeployedApplicationsIT verifyOsgiUrlIsAccessibleViaBridge History
Failing since build #1471 (Changes by Jesse White) Smoke Test 14 secs
Successful OSGIPluginManagerIT canAccessPluginDiagnostics History
Failing since build #1471 (Changes by Jesse White) Smoke Test 11 secs
Successful OSGIPluginManagerIT canInstallAndUnInstallPlugin History
Failing since build #1471 (Changes by Jesse White) Smoke Test 18 secs
Successful OSGIPluginManagerIT canListFeatures History
Failing since build #1471 (Changes by Jesse White) Smoke Test 11 secs
Successful OSGIPluginManagerIT canAccessLicenseDiagnostics History
Failing since build #1471 (Changes by Jesse White) Smoke Test 11 secs
Successful OSGIPluginManagerIT canListProducts History
Failing since build #1471 (Changes by Jesse White) Smoke Test 11 secs
Successful OSGIPluginManagerIT canAccessFeatureDiagnostics History
Failing since build #1471 (Changes by Jesse White) Smoke Test 11 secs
Successful OSGIPluginManagerIT canListPluginManifests History
Failing since build #1471 (Changes by Jesse White) Smoke Test 12 secs
Successful DataChoicesRestServiceIT verifyGet History
Failing since build #1471 (Changes by Jesse White) Smoke Test 14 secs
Successful DataChoicesRestServiceIT verifyUpdate History
Failing since build #1471 (Changes by Jesse White) Smoke Test 11 secs
Successful BSMTopologyIT canViewVertices History
Failing since build #1471 (Changes by Jesse White) Smoke Test 2 mins
Successful BSMTopologyIT canChangeFocusWhenInSimulationMode History
Failing since build #1471 (Changes by Jesse White) Smoke Test 2 mins
Successful GraphMLTopologyIT verifyCanFilterByCategory History
Failing since build #1471 (Changes by Jesse White) Smoke Test 2 mins
Successful GraphMLTopologyIT canUseTopology History
Failing since build #1471 (Changes by Jesse White) Smoke Test 2 mins
Successful GraphMLTopologyIT verifyNavigateToAndBreadcrumbs History
Failing since build #1471 (Changes by Jesse White) Smoke Test 2 mins
Successful GraphMLTopologyIT verifySwitchesLayerOnSearchProperly History
Failing since build #1471 (Changes by Jesse White) Smoke Test 1 min
Successful GraphMLTopologyIT verifySaveLayoutButton History
Failing since build #1471 (Changes by Jesse White) Smoke Test 2 mins
Successful TopologyIT canSelectKnownLayouts History
Failing since build #1471 (Changes by Jesse White) Smoke Test 3 mins
Successful TopologyIT canToggleAutomaticRefresh History
Failing since build #1471 (Changes by Jesse White) Smoke Test 4 mins