Build #1,471

Build: #1471 failed Changes by Jesse White

Build result summary

Details

Completed
Duration
705 minutes
Labels
None
Revisions
OpenNMS (develop branch)
ffda9b6e3f5dc329ec86cb9949699eed518f1f7e ffda9b6e3f5dc329ec86cb9949699eed518f1f7e
OpenNMS Installer
da12784d9ab4ba4aacedec0283d0c04075fd6ebf da12784d9ab4ba4aacedec0283d0c04075fd6ebf
OpenNMS-Repo
f5acfe3b3717db0f16e736d0f0b9ef0c9738b0cd f5acfe3b3717db0f16e736d0f0b9ef0c9738b0cd
Smoke Tests
cb1e72265cf2ce10cb4872f58120272b340a1ce1 cb1e72265cf2ce10cb4872f58120272b340a1ce1
OpenNMS Bamboo Utils
c5b0514a984dd599487469d47e6a69527d55515a c5b0514a984dd599487469d47e6a69527d55515a
OpenNMS System Test API
8add75059247ca77047f45bb0b36a6f1f069bbf3 8add75059247ca77047f45bb0b36a6f1f069bbf3
Total tests
8001
Failing since
#1470 (Rebuilt by Benjamin Reed)
Fixed in
#1476 (Changes by Chandra Gorantla <chandra@opennms.com> and DavidSmith <38085611+smith-opennms@users.noreply.github.com>)

Responsible

This build has been failing since #1470
No one has taken responsibility

Code commits

OpenNMS (develop branch)
Author Commit Message Commit date
Jesse White Jesse White ffda9b6e3f5dc329ec86cb9949699eed518f1f7e ffda9b6e3f5dc329ec86cb9949699eed518f1f7e Merge pull request #2120 from OpenNMS/jira/NMS-10306
NMS-10306: Add Karaf shell command for Daemon Reload
Chandra Gorantla <chandra@opennms.com> Chandra Gorantla <chandra@opennms.com> 61f89bd81d6013981c2864bc57f97a106fe01b09 m 61f89bd81d6013981c2864bc57f97a106fe01b09 nms-10306: Add docs, move Enum to common daemon
Chandra Gorantla <chandra@opennms.com> Chandra Gorantla <chandra@opennms.com> 422f4f1033845aa11ecdde6a79ebc718f89dd8e9 m 422f4f1033845aa11ecdde6a79ebc718f89dd8e9 Merge branch 'develop' into jira/NMS-10306
Chandra Gorantla <chandra@opennms.com> Chandra Gorantla <chandra@opennms.com> bfeb373c6115314af3723caea79bf77de0f1abb1 m bfeb373c6115314af3723caea79bf77de0f1abb1 nms-10306: Remove unnecessary logs, change syslogd daemon name
Chandra Gorantla <chandra@opennms.com> Chandra Gorantla <chandra@opennms.com> 95bb03b3ec19a0efa4bd463a2785507683e29027 m 95bb03b3ec19a0efa4bd463a2785507683e29027 nms-10306: add shell command for reload daemon

Tests

New test failures 71
Status Test View job Duration
Collapse Failed OnmsFeatureKarafIT testInstallFeatureOpennmsEventsCommands History
Integration Test 6 secs
org.ops4j.pax.exam.WrappedTestContainerException: [testInstallFeatureOpennmsEventsCommands(org.opennms.assemblies.karaf.OnmsFeatureKarafIT): org.osgi.service.resolver.ResolutionException: Unable to resolve root: missing requirement [root] osgi.identity; osgi.identity=opennms-events-commands; type=karaf.feature; version="[23.0.0.SNAPSHOT,23.0.0.SNAPSHOT]"; filter:="(&(osgi.identity=opennms-events-commands)(type=karaf.feature)(version>=23.0.0.SNAPSHOT)(version<=23.0.0.SNAPSHOT))" [caused by: Unable to resolve opennms-events-commands/23.0.0.SNAPSHOT: missing requirement [opennms-events-commands/23.0.0.SNAPSHOT] osgi.identity; osgi.identity=org.opennms.features.events.org.opennms.features.events.commands; type=osgi.bundle; version="[23.0.0.SNAPSHOT,23.0.0.SNAPSHOT]"; resolution:=mandatory [caused by: Unable to resolve org.opennms.features.events.org.opennms.features.events.commands/23.0.0.SNAPSHOT: missing requirement [org.opennms.features.events.org.opennms.features.events.commands/23.0.0.SNAPSHOT] osgi.wiring.package; filter:="(&(osgi.wiring.package=org.opennms.netmgt.daemon)(version>=23.0.0)(!(version>=24.0.0)))"]]]
	at org.opennms.core.test.karaf.KarafTestCase.installFeature(KarafTestCase.java:331)
	at org.opennms.assemblies.karaf.OnmsFeatureKarafIT.testInstallFeatureOpennmsEventsCommands(OnmsFeatureKarafIT.java:434)
Collapse Failed AdminPageIT testAllLinks History
Smoke Test 16 secs
java.lang.AssertionError: We expect 31 link entries on the admin page. expected:<31> but was:<24>
	at org.opennms.smoketest.AdminPageIT.testAllLinks(AdminPageIT.java:118)
Collapse Failed AlarmElasticsearch5IT canForwardAlarmToEs History
Smoke Test 2 mins
com.jayway.awaitility.core.ConditionTimeoutException: Lambda expression in org.opennms.smoketest.AlarmElasticsearch5IT that uses java.net.InetSocketAddress: expected <1L> but was <0> within 2 minutes.
	at org.opennms.smoketest.AlarmElasticsearch5IT.canForwardAlarmToEs(AlarmElasticsearch5IT.java:111)
Collapse Failed ClassificationRulePageIT verifyTabs History
Smoke Test 18 secs
org.openqa.selenium.TimeoutException: Timed out after 5 seconds waiting for org.opennms.smoketest.ClassificationRulePageIT$Page$$Lambda$24/603456365@217b0952
Build info: version: '2.53.1', revision: 'a36b8b1cd5757287168e54b817830adce9b0158d', time: '2016-06-30 19:26:09'
System info: host: 'stanford.internal.opennms.com', ip: '172.20.1.204', os.name: 'Linux', os.arch: 'amd64', os.version: '4.4.0-134-generic', java.version: '1.8.0_181'
Driver info: org.openqa.selenium.firefox.FirefoxDriver
Capabilities [{applicationCacheEnabled=true, rotatable=false, handlesAlerts=true, databaseEnabled=true, version=48.0, platform=LINUX, nativeEvents=false, acceptSslCerts=true, webStorageEnabled=true, locationContextEnabled=true, browserName=firefox, takesScreenshot=true, javascriptEnabled=true, cssSelectorsEnabled=true}]
Session ID: df0b0428-bfb8-4e82-9fd7-537091757faf
org.openqa.selenium.TimeoutException: 
Timed out after 5 seconds waiting for org.opennms.smoketest.ClassificationRulePageIT$Page$$Lambda$24/603456365@217b0952
(6 more lines...)
Collapse Failed ClassificationRulePageIT verifySrcValues History
Smoke Test 20 secs
org.openqa.selenium.TimeoutException: Timed out after 5 seconds waiting for org.opennms.smoketest.ClassificationRulePageIT$Page$$Lambda$24/603456365@ba86c53
Build info: version: '2.53.1', revision: 'a36b8b1cd5757287168e54b817830adce9b0158d', time: '2016-06-30 19:26:09'
System info: host: 'stanford.internal.opennms.com', ip: '172.20.1.204', os.name: 'Linux', os.arch: 'amd64', os.version: '4.4.0-134-generic', java.version: '1.8.0_181'
Driver info: org.openqa.selenium.firefox.FirefoxDriver
Capabilities [{applicationCacheEnabled=true, rotatable=false, handlesAlerts=true, databaseEnabled=true, version=48.0, platform=LINUX, nativeEvents=false, acceptSslCerts=true, webStorageEnabled=true, locationContextEnabled=true, browserName=firefox, takesScreenshot=true, javascriptEnabled=true, cssSelectorsEnabled=true}]
Session ID: 7c015a0f-7ae0-4677-94ec-705bd55eb13b
org.openqa.selenium.TimeoutException: 
Timed out after 5 seconds waiting for org.opennms.smoketest.ClassificationRulePageIT$Page$$Lambda$24/603456365@ba86c53
(6 more lines...)
Collapse Failed ClassificationRulePageIT verifyExporterFilter History
Smoke Test 18 secs
org.openqa.selenium.TimeoutException: Timed out after 5 seconds waiting for org.opennms.smoketest.ClassificationRulePageIT$Page$$Lambda$24/603456365@4f22fd5d
Build info: version: '2.53.1', revision: 'a36b8b1cd5757287168e54b817830adce9b0158d', time: '2016-06-30 19:26:09'
System info: host: 'stanford.internal.opennms.com', ip: '172.20.1.204', os.name: 'Linux', os.arch: 'amd64', os.version: '4.4.0-134-generic', java.version: '1.8.0_181'
Driver info: org.openqa.selenium.firefox.FirefoxDriver
Capabilities [{applicationCacheEnabled=true, rotatable=false, handlesAlerts=true, databaseEnabled=true, version=48.0, platform=LINUX, nativeEvents=false, acceptSslCerts=true, webStorageEnabled=true, locationContextEnabled=true, browserName=firefox, takesScreenshot=true, javascriptEnabled=true, cssSelectorsEnabled=true}]
Session ID: c3cc365d-076b-4bf1-8a0b-41a3064d1394
org.openqa.selenium.TimeoutException: 
Timed out after 5 seconds waiting for org.opennms.smoketest.ClassificationRulePageIT$Page$$Lambda$24/603456365@4f22fd5d
(6 more lines...)
Collapse Failed ClassificationRulePageIT verifySearch History
Smoke Test 19 secs
org.openqa.selenium.TimeoutException: Timed out after 5 seconds waiting for org.opennms.smoketest.ClassificationRulePageIT$Page$$Lambda$24/603456365@26f204a4
Build info: version: '2.53.1', revision: 'a36b8b1cd5757287168e54b817830adce9b0158d', time: '2016-06-30 19:26:09'
System info: host: 'stanford.internal.opennms.com', ip: '172.20.1.204', os.name: 'Linux', os.arch: 'amd64', os.version: '4.4.0-134-generic', java.version: '1.8.0_181'
Driver info: org.openqa.selenium.firefox.FirefoxDriver
Capabilities [{applicationCacheEnabled=true, rotatable=false, handlesAlerts=true, databaseEnabled=true, version=48.0, platform=LINUX, nativeEvents=false, acceptSslCerts=true, webStorageEnabled=true, locationContextEnabled=true, browserName=firefox, takesScreenshot=true, javascriptEnabled=true, cssSelectorsEnabled=true}]
Session ID: f129597d-ab21-44c4-99cf-b8338408dd24
org.openqa.selenium.TimeoutException: 
Timed out after 5 seconds waiting for org.opennms.smoketest.ClassificationRulePageIT$Page$$Lambda$24/603456365@26f204a4
(6 more lines...)
Collapse Failed ClassificationRulePageIT verifyRuleCRUD History
Smoke Test 19 secs
org.openqa.selenium.TimeoutException: Timed out after 5 seconds waiting for org.opennms.smoketest.ClassificationRulePageIT$Page$$Lambda$24/603456365@1906f982
Build info: version: '2.53.1', revision: 'a36b8b1cd5757287168e54b817830adce9b0158d', time: '2016-06-30 19:26:09'
System info: host: 'stanford.internal.opennms.com', ip: '172.20.1.204', os.name: 'Linux', os.arch: 'amd64', os.version: '4.4.0-134-generic', java.version: '1.8.0_181'
Driver info: org.openqa.selenium.firefox.FirefoxDriver
Capabilities [{applicationCacheEnabled=true, rotatable=false, handlesAlerts=true, databaseEnabled=true, version=48.0, platform=LINUX, nativeEvents=false, acceptSslCerts=true, webStorageEnabled=true, locationContextEnabled=true, browserName=firefox, takesScreenshot=true, javascriptEnabled=true, cssSelectorsEnabled=true}]
Session ID: 80407320-215e-4603-bdf2-feab56967f7a
org.openqa.selenium.TimeoutException: 
Timed out after 5 seconds waiting for org.opennms.smoketest.ClassificationRulePageIT$Page$$Lambda$24/603456365@1906f982
(6 more lines...)
Collapse Failed ClassificationRulePageIT verifyClassification History
Smoke Test 20 secs
org.openqa.selenium.TimeoutException: Timed out after 5 seconds waiting for org.opennms.smoketest.ClassificationRulePageIT$Page$$Lambda$24/603456365@408d945b
Build info: version: '2.53.1', revision: 'a36b8b1cd5757287168e54b817830adce9b0158d', time: '2016-06-30 19:26:09'
System info: host: 'stanford.internal.opennms.com', ip: '172.20.1.204', os.name: 'Linux', os.arch: 'amd64', os.version: '4.4.0-134-generic', java.version: '1.8.0_181'
Driver info: org.openqa.selenium.firefox.FirefoxDriver
Capabilities [{applicationCacheEnabled=true, rotatable=false, handlesAlerts=true, databaseEnabled=true, version=48.0, platform=LINUX, nativeEvents=false, acceptSslCerts=true, webStorageEnabled=true, locationContextEnabled=true, browserName=firefox, takesScreenshot=true, javascriptEnabled=true, cssSelectorsEnabled=true}]
Session ID: 3a533aba-16e5-4061-ae7c-ffd67116709b
org.openqa.selenium.TimeoutException: 
Timed out after 5 seconds waiting for org.opennms.smoketest.ClassificationRulePageIT$Page$$Lambda$24/603456365@408d945b
(6 more lines...)
Collapse Failed ClassificationRulePageIT verifySettingsTab History
Smoke Test 20 secs
org.openqa.selenium.TimeoutException: Timed out after 5 seconds waiting for org.opennms.smoketest.ClassificationRulePageIT$Page$$Lambda$24/603456365@49665f92
Build info: version: '2.53.1', revision: 'a36b8b1cd5757287168e54b817830adce9b0158d', time: '2016-06-30 19:26:09'
System info: host: 'stanford.internal.opennms.com', ip: '172.20.1.204', os.name: 'Linux', os.arch: 'amd64', os.version: '4.4.0-134-generic', java.version: '1.8.0_181'
Driver info: org.openqa.selenium.firefox.FirefoxDriver
Capabilities [{applicationCacheEnabled=true, rotatable=false, handlesAlerts=true, databaseEnabled=true, version=48.0, platform=LINUX, nativeEvents=false, acceptSslCerts=true, webStorageEnabled=true, locationContextEnabled=true, browserName=firefox, takesScreenshot=true, javascriptEnabled=true, cssSelectorsEnabled=true}]
Session ID: 3ebd7e2a-0175-4556-8e83-7d44465e4f0d
org.openqa.selenium.TimeoutException: 
Timed out after 5 seconds waiting for org.opennms.smoketest.ClassificationRulePageIT$Page$$Lambda$24/603456365@49665f92
(6 more lines...)
Collapse Failed ClassificationRulePageIT verifyErrorMessageReset History
Smoke Test 18 secs
org.openqa.selenium.TimeoutException: Timed out after 5 seconds waiting for org.opennms.smoketest.ClassificationRulePageIT$Page$$Lambda$24/603456365@59b853aa
Build info: version: '2.53.1', revision: 'a36b8b1cd5757287168e54b817830adce9b0158d', time: '2016-06-30 19:26:09'
System info: host: 'stanford.internal.opennms.com', ip: '172.20.1.204', os.name: 'Linux', os.arch: 'amd64', os.version: '4.4.0-134-generic', java.version: '1.8.0_181'
Driver info: org.openqa.selenium.firefox.FirefoxDriver
Capabilities [{applicationCacheEnabled=true, rotatable=false, handlesAlerts=true, databaseEnabled=true, version=48.0, platform=LINUX, nativeEvents=false, acceptSslCerts=true, webStorageEnabled=true, locationContextEnabled=true, browserName=firefox, takesScreenshot=true, javascriptEnabled=true, cssSelectorsEnabled=true}]
Session ID: 4a6a0941-ea25-42bf-811d-3586377727b1
org.openqa.selenium.TimeoutException: 
Timed out after 5 seconds waiting for org.opennms.smoketest.ClassificationRulePageIT$Page$$Lambda$24/603456365@59b853aa
(6 more lines...)
Collapse Failed ClassificationRulePageIT verifyReadOnlyGroup History
Smoke Test 18 secs
org.openqa.selenium.TimeoutException: Timed out after 5 seconds waiting for org.opennms.smoketest.ClassificationRulePageIT$Page$$Lambda$24/603456365@6cc44207
Build info: version: '2.53.1', revision: 'a36b8b1cd5757287168e54b817830adce9b0158d', time: '2016-06-30 19:26:09'
System info: host: 'stanford.internal.opennms.com', ip: '172.20.1.204', os.name: 'Linux', os.arch: 'amd64', os.version: '4.4.0-134-generic', java.version: '1.8.0_181'
Driver info: org.openqa.selenium.firefox.FirefoxDriver
Capabilities [{applicationCacheEnabled=true, rotatable=false, handlesAlerts=true, databaseEnabled=true, version=48.0, platform=LINUX, nativeEvents=false, acceptSslCerts=true, webStorageEnabled=true, locationContextEnabled=true, browserName=firefox, takesScreenshot=true, javascriptEnabled=true, cssSelectorsEnabled=true}]
Session ID: 748842e2-d9be-4d9b-a3b2-30bbfb395bed
org.openqa.selenium.TimeoutException: 
Timed out after 5 seconds waiting for org.opennms.smoketest.ClassificationRulePageIT$Page$$Lambda$24/603456365@6cc44207
(6 more lines...)
Collapse Failed ClassificationRulePageIT verifyRulePaginationAndDeleteAll History
Smoke Test 22 secs
org.openqa.selenium.TimeoutException: Timed out after 5 seconds waiting for org.opennms.smoketest.ClassificationRulePageIT$Page$$Lambda$24/603456365@67593f7b
Build info: version: '2.53.1', revision: 'a36b8b1cd5757287168e54b817830adce9b0158d', time: '2016-06-30 19:26:09'
System info: host: 'stanford.internal.opennms.com', ip: '172.20.1.204', os.name: 'Linux', os.arch: 'amd64', os.version: '4.4.0-134-generic', java.version: '1.8.0_181'
Driver info: org.openqa.selenium.firefox.FirefoxDriver
Capabilities [{applicationCacheEnabled=true, rotatable=false, handlesAlerts=true, databaseEnabled=true, version=48.0, platform=LINUX, nativeEvents=false, acceptSslCerts=true, webStorageEnabled=true, locationContextEnabled=true, browserName=firefox, takesScreenshot=true, javascriptEnabled=true, cssSelectorsEnabled=true}]
Session ID: e09021e4-ddd2-4cc5-8237-800b0f61116c
org.openqa.selenium.TimeoutException: 
Timed out after 5 seconds waiting for org.opennms.smoketest.ClassificationRulePageIT$Page$$Lambda$24/603456365@67593f7b
(6 more lines...)
Collapse Failed ClassificationRestIT verifyGetNonExisting History
Smoke Test 12 secs
java.lang.AssertionError: 1 expectation failed.
Expected status code <200> but was <404>.

java.lang.AssertionError: 
1 expectation failed.
Expected status code <200> but was <404>.

	at org.opennms.smoketest.flow.ClassificationRestIT.setEnabled(ClassificationRestIT.java:333)
(1 more lines...)
Collapse Failed ClassificationRestIT verifyUpdateNonExisting History
Smoke Test 16 secs
java.lang.AssertionError: 1 expectation failed.
Expected status code <200> but was <404>.

java.lang.AssertionError: 
1 expectation failed.
Expected status code <200> but was <404>.

	at org.opennms.smoketest.flow.ClassificationRestIT.setEnabled(ClassificationRestIT.java:333)
(1 more lines...)
Collapse Failed ClassificationRestIT verifyExportGroup History
Smoke Test 12 secs
java.lang.AssertionError: 1 expectation failed.
Expected status code <200> but was <404>.

java.lang.AssertionError: 
1 expectation failed.
Expected status code <200> but was <404>.

	at org.opennms.smoketest.flow.ClassificationRestIT.setEnabled(ClassificationRestIT.java:333)
(1 more lines...)
Collapse Failed ClassificationRestIT verifyProtocols History
Smoke Test 14 secs
java.lang.AssertionError: 1 expectation failed.
Expected status code <200> but was <404>.

java.lang.AssertionError: 
1 expectation failed.
Expected status code <200> but was <404>.

	at org.opennms.smoketest.flow.ClassificationRestIT.setEnabled(ClassificationRestIT.java:333)
(1 more lines...)
Collapse Failed ClassificationRestIT verifyDisableGroup History
Smoke Test 12 secs
java.lang.AssertionError: 1 expectation failed.
Expected status code <200> but was <404>.

java.lang.AssertionError: 
1 expectation failed.
Expected status code <200> but was <404>.

	at org.opennms.smoketest.flow.ClassificationRestIT.setEnabled(ClassificationRestIT.java:333)
(1 more lines...)
Collapse Failed ClassificationRestIT verifyClassifyEmpty History
Smoke Test 12 secs
java.lang.AssertionError: 1 expectation failed.
Expected status code <200> but was <404>.

java.lang.AssertionError: 
1 expectation failed.
Expected status code <200> but was <404>.

	at org.opennms.smoketest.flow.ClassificationRestIT.setEnabled(ClassificationRestIT.java:333)
(1 more lines...)
Collapse Failed ClassificationRestIT verifyCreateNull History
Smoke Test 12 secs
java.lang.AssertionError: 1 expectation failed.
Expected status code <200> but was <404>.

java.lang.AssertionError: 
1 expectation failed.
Expected status code <200> but was <404>.

	at org.opennms.smoketest.flow.ClassificationRestIT.setEnabled(ClassificationRestIT.java:333)
(1 more lines...)
Collapse Failed ClassificationRestIT verifyCRUD History
Smoke Test 13 secs
java.lang.AssertionError: 1 expectation failed.
Expected status code <200> but was <404>.

java.lang.AssertionError: 
1 expectation failed.
Expected status code <200> but was <404>.

	at org.opennms.smoketest.flow.ClassificationRestIT.setEnabled(ClassificationRestIT.java:333)
(1 more lines...)
Collapse Failed ClassificationRestIT verifyDeleteNonExisting History
Smoke Test 14 secs
java.lang.AssertionError: 1 expectation failed.
Expected status code <200> but was <404>.

java.lang.AssertionError: 
1 expectation failed.
Expected status code <200> but was <404>.

	at org.opennms.smoketest.flow.ClassificationRestIT.setEnabled(ClassificationRestIT.java:333)
(1 more lines...)
Collapse Failed ClassificationRestIT verifyClassify History
Smoke Test 12 secs
java.lang.AssertionError: 1 expectation failed.
Expected status code <200> but was <404>.

java.lang.AssertionError: 
1 expectation failed.
Expected status code <200> but was <404>.

	at org.opennms.smoketest.flow.ClassificationRestIT.setEnabled(ClassificationRestIT.java:333)
(1 more lines...)
Collapse Failed ClassificationRestIT verifyImport History
Smoke Test 13 secs
java.lang.AssertionError: 1 expectation failed.
Expected status code <200> but was <404>.

java.lang.AssertionError: 
1 expectation failed.
Expected status code <200> but was <404>.

	at org.opennms.smoketest.flow.ClassificationRestIT.setEnabled(ClassificationRestIT.java:333)
(1 more lines...)
Collapse Failed FlowStackIT verifyFlowStack History
Smoke Test 1 min
javax.ws.rs.NotFoundException: HTTP 404 Not Found
	at org.opennms.smoketest.flow.FlowStackIT.verifyFlowStack(FlowStackIT.java:127)
Collapse Failed HealthCheckIT verifyOpenNMSHealth History
Smoke Test 5 mins
com.jayway.awaitility.core.ConditionTimeoutException: Condition with lambda expression in org.opennms.smoketest.health.HealthCheckIT was not fulfilled within 5 minutes.
	at org.opennms.smoketest.health.HealthCheckIT.verifyHealthCheck(HealthCheckIT.java:126)
	at org.opennms.smoketest.health.HealthCheckIT.verifyOpenNMSHealth(HealthCheckIT.java:104)
Collapse Failed IndexPageIT verifyStatusMap History
Smoke Test 2 mins
org.openqa.selenium.TimeoutException: Timed out after 120 seconds waiting for org.opennms.smoketest.IndexPageIT$1@5def348b
Build info: version: '2.53.1', revision: 'a36b8b1cd5757287168e54b817830adce9b0158d', time: '2016-06-30 19:26:09'
System info: host: 'stanford.internal.opennms.com', ip: '172.20.1.204', os.name: 'Linux', os.arch: 'amd64', os.version: '4.4.0-134-generic', java.version: '1.8.0_181'
Driver info: org.openqa.selenium.firefox.FirefoxDriver
Capabilities [{applicationCacheEnabled=true, rotatable=false, handlesAlerts=true, databaseEnabled=true, version=48.0, platform=LINUX, nativeEvents=false, acceptSslCerts=true, webStorageEnabled=true, locationContextEnabled=true, browserName=firefox, takesScreenshot=true, javascriptEnabled=true, cssSelectorsEnabled=true}]
Session ID: d1ae6240-8d10-441e-8c0f-6608778fc635
org.openqa.selenium.TimeoutException: 
Timed out after 120 seconds waiting for org.opennms.smoketest.IndexPageIT$1@5def348b
(6 more lines...)
Collapse Failed JmxConfigurationGeneratorIT verifyCompMemberSelection History
Smoke Test 2 mins
org.openqa.selenium.TimeoutException: Timed out after 120 seconds waiting for org.opennms.smoketest.OpenNMSSeleniumTestCase$14@7bfca354
Build info: version: '2.53.1', revision: 'a36b8b1cd5757287168e54b817830adce9b0158d', time: '2016-06-30 19:26:09'
System info: host: 'stanford.internal.opennms.com', ip: '172.20.1.204', os.name: 'Linux', os.arch: 'amd64', os.version: '4.4.0-134-generic', java.version: '1.8.0_181'
Driver info: org.openqa.selenium.firefox.FirefoxDriver
Capabilities [{applicationCacheEnabled=true, rotatable=false, handlesAlerts=true, databaseEnabled=true, version=48.0, platform=LINUX, nativeEvents=false, acceptSslCerts=true, webStorageEnabled=true, locationContextEnabled=true, browserName=firefox, takesScreenshot=true, javascriptEnabled=true, cssSelectorsEnabled=true}]
Session ID: d2cf48e5-66f1-436f-ad3d-38ba14bfeb58
org.openqa.selenium.TimeoutException: 
Timed out after 120 seconds waiting for org.opennms.smoketest.OpenNMSSeleniumTestCase$14@7bfca354
(7 more lines...)
Collapse Failed JmxConfigurationGeneratorIT testClickOnHeaderLinkWorks History
Smoke Test 2 mins
org.openqa.selenium.NoSuchElementException: Unable to locate element: {"method":"link text","selector":"1. Service Configuration"}
Command duration or timeout: 120.05 seconds
For documentation on this error, please visit: http://seleniumhq.org/exceptions/no_such_element.html
Build info: version: '2.53.1', revision: 'a36b8b1cd5757287168e54b817830adce9b0158d', time: '2016-06-30 19:26:09'
System info: host: 'stanford.internal.opennms.com', ip: '172.20.1.204', os.name: 'Linux', os.arch: 'amd64', os.version: '4.4.0-134-generic', java.version: '1.8.0_181'
Driver info: org.openqa.selenium.firefox.FirefoxDriver
Capabilities [{applicationCacheEnabled=true, rotatable=false, handlesAlerts=true, databaseEnabled=true, version=48.0, platform=LINUX, nativeEvents=false, acceptSslCerts=true, webStorageEnabled=true, locationContextEnabled=true, browserName=firefox, takesScreenshot=true, javascriptEnabled=true, cssSelectorsEnabled=true}]
Session ID: 67bfd814-be4f-4d9a-8d00-430da9143e92
(18 more lines...)
Collapse Failed JmxConfigurationGeneratorIT testNavigation History
Smoke Test 2 mins
org.openqa.selenium.TimeoutException: Timed out after 120 seconds waiting for org.opennms.smoketest.OpenNMSSeleniumTestCase$14@647564c2
Build info: version: '2.53.1', revision: 'a36b8b1cd5757287168e54b817830adce9b0158d', time: '2016-06-30 19:26:09'
System info: host: 'stanford.internal.opennms.com', ip: '172.20.1.204', os.name: 'Linux', os.arch: 'amd64', os.version: '4.4.0-134-generic', java.version: '1.8.0_181'
Driver info: org.openqa.selenium.firefox.FirefoxDriver
Capabilities [{applicationCacheEnabled=true, rotatable=false, handlesAlerts=true, databaseEnabled=true, version=48.0, platform=LINUX, nativeEvents=false, acceptSslCerts=true, webStorageEnabled=true, locationContextEnabled=true, browserName=firefox, takesScreenshot=true, javascriptEnabled=true, cssSelectorsEnabled=true}]
Session ID: feb144d7-3456-40ec-a340-c2ac1a26b753
org.openqa.selenium.TimeoutException: 
Timed out after 120 seconds waiting for org.opennms.smoketest.OpenNMSSeleniumTestCase$14@647564c2
(7 more lines...)
Collapse Failed KafkaPersisterIT testKafkaPersisterForMetrics History
Smoke Test 2 mins
com.jayway.awaitility.core.ConditionTimeoutException: Lambda expression in org.opennms.smoketest.BaseKafkaPersisterIT: expected a string containing "Persisted collection" but was <
   ____                   _   _ __  __  _____  
  / __ \                 | \ | |  \/  |/ ____| 
 | |  | |_ __   ___ _ __ |  \| | \  / | (___   
 | |  | | '_ \ / _ \ '_ \| . ` | |\/| |\___ \  
 | |__| | |_) |  __/ | | | |\  | |  | |____) | 
  \____/| .__/ \___|_| |_|_| \_|_|  |_|_____/  
        | |                                    
(51 more lines...)
Collapse Failed KafkaProducerIT testKafkaPersisterForMetrics History
Smoke Test 2 mins
com.jayway.awaitility.core.ConditionTimeoutException: Lambda expression in org.opennms.smoketest.BaseKafkaPersisterIT: expected a string containing "Persisted collection" but was <
   ____                   _   _ __  __  _____  
  / __ \                 | \ | |  \/  |/ ____| 
 | |  | |_ __   ___ _ __ |  \| | \  / | (___   
 | |  | | '_ \ / _ \ '_ \| . ` | |\/| |\___ \  
 | |__| | |_) |  __/ | | | |\  | |  | |____) | 
  \____/| .__/ \___|_| |_|_| \_|_|  |_|_____/  
        | |                                    
(51 more lines...)
Collapse Failed MenuHeaderIT testMenuEntries History
Smoke Test 2 mins
org.openqa.selenium.TimeoutException: Timed out after 120 seconds waiting for visibility of element located by By.xpath: //span[text()='Surveillance view: default']
Build info: version: '2.53.1', revision: 'a36b8b1cd5757287168e54b817830adce9b0158d', time: '2016-06-30 19:26:09'
System info: host: 'stanford.internal.opennms.com', ip: '172.20.1.204', os.name: 'Linux', os.arch: 'amd64', os.version: '4.4.0-134-generic', java.version: '1.8.0_181'
Driver info: org.openqa.selenium.firefox.FirefoxDriver
Capabilities [{applicationCacheEnabled=true, rotatable=false, handlesAlerts=true, databaseEnabled=true, version=48.0, platform=LINUX, nativeEvents=false, acceptSslCerts=true, webStorageEnabled=true, locationContextEnabled=true, browserName=firefox, takesScreenshot=true, javascriptEnabled=true, cssSelectorsEnabled=true}]
Session ID: 0221afed-be3e-40ac-82db-fd570fb1fbff
org.openqa.selenium.TimeoutException: 
Timed out after 120 seconds waiting for visibility of element located by By.xpath: //span[text()='Surveillance view: default']
(23 more lines...)
Collapse Failed CollectorListIT canLoadCollectorsOnOpenNMS History
Smoke Test 3 mins
com.jayway.awaitility.core.ConditionTimeoutException: Lambda expression in org.opennms.smoketest.minion.CollectorListIT: expected a collection with size <0> but was <[org.opennms.netmgt.collectd.SnmpCollector, org.opennms.netmgt.collectd.HttpCollector, org.opennms.netmgt.collectd.JdbcCollector, org.opennms.netmgt.collectd.Jsr160Collector, org.opennms.netmgt.collectd.VmwareCimCollector, org.opennms.netmgt.collectd.VmwareCollector, org.opennms.netmgt.collectd.WmiCollector, org.opennms.netmgt.collectd.WsManCollector, org.opennms.protocols.xml.collector.XmlCollector]> within 3 minutes.
	at org.opennms.smoketest.minion.CollectorListIT.canLoadCollectorsOnOpenNMS(CollectorListIT.java:119)
Collapse Failed DetectorsCommandIT canLoadDetectorsOnOpenNMS History
Smoke Test 3 mins
com.jayway.awaitility.core.ConditionTimeoutException: Lambda expression in org.opennms.smoketest.minion.DetectorsCommandIT: expected a collection with size <0> but was <[BGP_Session, BSF, CITRIX, Cisco_IP_SLA, DNS, Dell_OpenManageChassis, DiskUsage, DominoIIOP, FTP, GP, HOST-RESOURCES, HTTP, HTTPS, ICMP, IMAP, IMAPS, JDBC, JSR160, JdbcQueryDetector, JdbcStoredProcedureDetector, LDAP, LDAPS, LOOP, MSExchange, Memcached, NOTES, NRPE, NTP, OMSAStorage, PERC, POP3, SMB, SMTP, SNMP, SSH, TCP, TrivialTime, WEB, WMI, WS-Man, Win32Service]> within 3 minutes.
	at org.opennms.smoketest.minion.DetectorsCommandIT.canLoadDetectorsOnOpenNMS(DetectorsCommandIT.java:151)
Collapse Failed JMXCollectorIT canPerformAdhocJmxCollection History
Smoke Test 2 mins
com.jayway.awaitility.core.ConditionTimeoutException: Lambda expression in org.opennms.smoketest.minion.JMXCollectorIT: expected a string containing "java_lang_type_OperatingSystem" but was < -l MINION org.opennms.netmgt.collectd.Jsr160Collector 127.0.0.1 port=18980
Command not found: collection:collect
admin@opennms> logout
> within 3 minutes.
com.jayway.awaitility.core.ConditionTimeoutException: 
Lambda expression in org.opennms.smoketest.minion.JMXCollectorIT: expected a string containing "java_lang_type_OperatingSystem" but was < -l MINION org.opennms.netmgt.collectd.Jsr160Collector 127.0.0.1 port=18980

Command not found: collection:collect
(4 more lines...)
Collapse Failed JtiTelemetryIT verifyJtiTelemetryOnMinion History
Smoke Test 2 mins
com.jayway.awaitility.core.ConditionTimeoutException: Condition returned by method "matchRrdFileFromNodeResource" in class org.opennms.smoketest.minion.JtiTelemetryIT was not fulfilled within 2 minutes.
	at org.opennms.smoketest.minion.JtiTelemetryIT.verifyJtiTelemetryOnMinion(JtiTelemetryIT.java:183)
Collapse Failed JtiTelemetryIT verifyJtiTelemetryOnOpenNMS History
Smoke Test 45 secs
com.jayway.awaitility.core.ConditionTimeoutException: Condition returned by method "matchRrdFileFromNodeResource" in class org.opennms.smoketest.minion.JtiTelemetryIT was not fulfilled within 30 seconds.
	at org.opennms.smoketest.minion.JtiTelemetryIT.verifyJtiTelemetryOnOpenNMS(JtiTelemetryIT.java:154)
Collapse Failed MonitorsListCommandIT canLoadMonitorsOnOpenNMS History
Smoke Test 3 mins
com.jayway.awaitility.core.ConditionTimeoutException: Lambda expression in org.opennms.smoketest.minion.MonitorsListCommandIT: expected a collection with size <0> but was <[org.opennms.netmgt.poller.monitors.DNSResolutionMonitor, org.opennms.netmgt.poller.monitors.JDBCQueryMonitor, org.opennms.netmgt.poller.monitors.DskTableMonitor, org.opennms.netmgt.poller.monitors.SmbMonitor, org.opennms.netmgt.poller.monitors.HttpMonitor, org.opennms.netmgt.poller.monitors.PercMonitor, org.opennms.netmgt.poller.monitors.HttpsMonitor, org.opennms.netmgt.poller.monitors.SSLCertMonitor, org.opennms.netmgt.poller.monitors.MailTransportMonitor, org.opennms.netmgt.poller.monitors.OpenManageChassisMonitor, org.opennms.netmgt.poller.monitors.BgpSessionMonitor, org.opennms.netmgt.poller.monitors.TcpMonitor, org.opennms.netmgt.poller.monitors.MemcachedMonitor, org.opennms.netmgt.poller.monitors.ImapMonitor, org.opennms.netmgt.poller.monitors.SshMonitor, org.opennms.netmgt.poller.monitors.PageSequenceMonitor, org.opennms.netmgt.poller.monitors.LaTableMonitor, org.opennms.netmgt.poller.monitors.HttpPostMonitor, org.opennms.netmgt.poller.monitors.Jsr160Monitor, org.opennms.netmgt.poller.monitors.LdapsMonitor, org.opennms.netmgt.poller.monitors.ImapsMonitor, org.opennms.netmgt.poller.monitors.DiskUsageMonitor, org.opennms.netmgt.poller.monitors.SystemExecuteMonitor, org.opennms.netmgt.poller.monitors.CitrixMonitor, org.opennms.netmgt.poller.monitors.SmtpMonitor, org.opennms.netmgt.poller.monitors.TrivialTimeMonitor, org.opennms.netmgt.poller.monitors.JolokiaBeanMonitor, org.opennms.netmgt.poller.monitors.LoopMonitor, org.opennms.netmgt.poller.monitors.FtpMonitor, org.opennms.netmgt.poller.monitors.NrpeMonitor, org.opennms.netmgt.poller.monitors.AvailabilityMonitor, org.opennms.netmgt.poller.monitors.LogMatchTableMonitor, org.opennms.netmgt.poller.monitors.Win32ServiceMonitor, org.opennms.netmgt.poller.monitors.NtpMonitor, org.opennms.netmgt.poller.monitors.CiscoPingMibMonitor, org.opennms.netmgt.poller.monitors.StrafePingMonitor, org.opennms.netmgt.poller.monitors.LdapMonitor, org.opennms.netmgt.poller.monitors.Pop3Monitor, org.opennms.netmgt.poller.monitors.DominoIIOPMonitor, org.opennms.netmgt.poller.monitors.DnsMonitor, org.opennms.netmgt.poller.monitors.SnmpMonitor, org.opennms.netmgt.poller.monitors.PrTableMonitor, org.opennms.netmgt.poller.monitors.IcmpMonitor, org.opennms.netmgt.poller.monitors.JDBCMonitor, org.opennms.netmgt.poller.monitors.JDBCStoredProcedureMonitor, org.opennms.netmgt.poller.monitors.BSFMonitor, org.opennms.netmgt.poller.monitors.OmsaStorageMonitor, org.opennms.netmgt.poller.monitors.HostResourceSwRunMonitor, org.opennms.netmgt.poller.monitors.NetScalerGroupHealthMonitor, org.opennms.netmgt.poller.monitors.WebMonitor, org.opennms.netmgt.poller.monitors.CiscoIpSlaMonitor, org.opennms.netmgt.poller.monitors.VmwareMonitor, org.opennms.netmgt.poller.monitors.VmwareCimMonitor, org.opennms.netmgt.poller.monitors.WsManMonitor]> within 3 minutes.
	at org.opennms.smoketest.minion.MonitorsListCommandIT.canLoadMonitorsOnOpenNMS(MonitorsListCommandIT.java:152)
Collapse Failed NxosTelemetryIT verifyNxosTelemetryOnMinion History
Smoke Test 2 mins
com.jayway.awaitility.core.ConditionTimeoutException: Condition returned by method "matchRrdFileFromNodeResource" in class org.opennms.smoketest.minion.NxosTelemetryIT was not fulfilled within 2 minutes.
	at org.opennms.smoketest.minion.NxosTelemetryIT.verifyNxosTelemetryOnMinion(NxosTelemetryIT.java:163)
Collapse Failed NxosTelemetryIT verifyNxosTelemetryOnOpenNMS History
Smoke Test 1 min
com.jayway.awaitility.core.ConditionTimeoutException: Condition returned by method "matchRrdFileFromNodeResource" in class org.opennms.smoketest.minion.NxosTelemetryIT was not fulfilled within 30 seconds.
	at org.opennms.smoketest.minion.NxosTelemetryIT.verifyNxosTelemetryOnOpenNMS(NxosTelemetryIT.java:135)
Collapse Failed RpcOverKafkaIT verifyKafkaRpcWithIcmpServiceDetection History
Smoke Test 3 mins
com.jayway.awaitility.core.ConditionTimeoutException: Lambda expression in org.opennms.smoketest.minion.RpcOverKafkaIT: expected a string containing "'ICMP' WAS detected on 127.0.0.1" but was <
Command not found: detect
admin@opennms> logout
> within 3 minutes.
com.jayway.awaitility.core.ConditionTimeoutException: 
Lambda expression in org.opennms.smoketest.minion.RpcOverKafkaIT: expected a string containing "'ICMP' WAS detected on 127.0.0.1" but was <

Command not found: detect
(4 more lines...)
Collapse Failed SyslogKafkaElasticsearchBufferingIT testMinionSyslogsOverKafkaToEsRest History
Smoke Test 9 mins
com.jayway.awaitility.core.ConditionTimeoutException: Condition with lambda expression in org.opennms.smoketest.minion.AbstractSyslogTestCase that uses java.util.function.Supplier, java.util.function.Supplierjava.util.function.Supplier, java.util.function.Supplierint was not fulfilled within 5 minutes.
	at org.opennms.smoketest.minion.SyslogKafkaElasticsearchBufferingIT.testMinionSyslogsOverKafkaToEsRest(SyslogKafkaElasticsearchBufferingIT.java:180)
Collapse Failed NodeDetailPageIT canUseViewInTopology History
Smoke Test 2 mins
org.openqa.selenium.NoSuchElementException: Unable to locate element: {"method":"link text","selector":"View in Topology"}
Command duration or timeout: 120.15 seconds
For documentation on this error, please visit: http://seleniumhq.org/exceptions/no_such_element.html
Build info: version: '2.53.1', revision: 'a36b8b1cd5757287168e54b817830adce9b0158d', time: '2016-06-30 19:26:09'
System info: host: 'stanford.internal.opennms.com', ip: '172.20.1.204', os.name: 'Linux', os.arch: 'amd64', os.version: '4.4.0-134-generic', java.version: '1.8.0_181'
Driver info: org.openqa.selenium.firefox.FirefoxDriver
Capabilities [{applicationCacheEnabled=true, rotatable=false, handlesAlerts=true, databaseEnabled=true, version=48.0, platform=LINUX, nativeEvents=false, acceptSslCerts=true, webStorageEnabled=true, locationContextEnabled=true, browserName=firefox, takesScreenshot=true, javascriptEnabled=true, cssSelectorsEnabled=true}]
Session ID: 66dba981-8054-4c42-9004-a503189443f8
(18 more lines...)
Collapse Failed OpsBoardAdminPageIT canCreateAndPreview History
Smoke Test 2 mins
org.openqa.selenium.NoSuchElementException: Unable to locate element: {"method":"xpath","selector":"//div[@class='v-captiontext' and contains(text(), '+')]"}
Command duration or timeout: 120.06 seconds
For documentation on this error, please visit: http://seleniumhq.org/exceptions/no_such_element.html
Build info: version: '2.53.1', revision: 'a36b8b1cd5757287168e54b817830adce9b0158d', time: '2016-06-30 19:26:09'
System info: host: 'stanford.internal.opennms.com', ip: '172.20.1.204', os.name: 'Linux', os.arch: 'amd64', os.version: '4.4.0-134-generic', java.version: '1.8.0_181'
Driver info: org.openqa.selenium.firefox.FirefoxDriver
Capabilities [{applicationCacheEnabled=true, rotatable=false, handlesAlerts=true, databaseEnabled=true, version=48.0, platform=LINUX, nativeEvents=false, acceptSslCerts=true, webStorageEnabled=true, locationContextEnabled=true, browserName=firefox, takesScreenshot=true, javascriptEnabled=true, cssSelectorsEnabled=true}]
Session ID: 641c3aa0-bd3c-476d-b929-df16f33b7ae4
(18 more lines...)
Collapse Failed OsgiDeployedApplicationsIT verifyOsgiUrlIsAccessibleViaBridge History
Smoke Test 17 secs
java.lang.AssertionError: URL: http://127.0.0.1:33551/opennms/admin/jmx-config-tool: status 200 (OK) expected but 404 (Not Found) received. expected:<200> but was:<404>
	at org.opennms.smoketest.OsgiDeployedApplicationsIT.verifyUrls(OsgiDeployedApplicationsIT.java:82)
	at org.opennms.smoketest.OsgiDeployedApplicationsIT.verifyOsgiUrlIsAccessibleViaBridge(OsgiDeployedApplicationsIT.java:54)
Collapse Failed OSGIPluginManagerIT canListProducts History
Smoke Test 12 secs
java.lang.AssertionError: expected:<200> but was:<404>
	at org.opennms.smoketest.OSGIPluginManagerIT.canListProducts(OSGIPluginManagerIT.java:58)
Collapse Failed OSGIPluginManagerIT canAccessFeatureDiagnostics History
Smoke Test 12 secs
java.lang.AssertionError: expected:<200> but was:<404>
	at org.opennms.smoketest.OSGIPluginManagerIT.canAccessFeatureDiagnostics(OSGIPluginManagerIT.java:78)
Collapse Failed OSGIPluginManagerIT canInstallAndUnInstallPlugin History
Smoke Test 15 secs
java.lang.AssertionError: expected:<200> but was:<404>
	at org.opennms.smoketest.OSGIPluginManagerIT.canInstallAndUnInstallPlugin(OSGIPluginManagerIT.java:115)
Collapse Failed OSGIPluginManagerIT canAccessPluginDiagnostics History
Smoke Test 12 secs
java.lang.AssertionError: expected:<200> but was:<404>
	at org.opennms.smoketest.OSGIPluginManagerIT.canAccessPluginDiagnostics(OSGIPluginManagerIT.java:83)
Fixed tests 1
Status Test Failing since View job Duration
Successful SinkBlueprintMessageFailureIT doesntLogMessageBody History
Failing since build #1470 (Rebuilt by Benjamin Reed) Integration Test 5 secs

Jira issues

IssueDescriptionStatus
Unknown Issue TypeNMS-10306Could not obtain issue details from Jira