Build #1,333

Build: #1333 failed Changes by Benjamin Reed

Build result summary

Details

Completed
Duration
214 minutes
Labels
None
Revisions
OpenNMS (develop branch)
2aaa90eb2628e1f70f56cd581e65b0398984ffd0 2aaa90eb2628e1f70f56cd581e65b0398984ffd0
OpenNMS Installer
097d795b47516b80de791e4786b56c3f04e6a0d2 097d795b47516b80de791e4786b56c3f04e6a0d2
OpenNMS-Repo
457706871a1c7d1b14bb103f851c825589f59748 457706871a1c7d1b14bb103f851c825589f59748
Smoke Tests
cb1e72265cf2ce10cb4872f58120272b340a1ce1 cb1e72265cf2ce10cb4872f58120272b340a1ce1
OpenNMS Bamboo Utils
72e855c2ebd93a882694b6c3a637e02db57bfe83 72e855c2ebd93a882694b6c3a637e02db57bfe83
OpenNMS System Test API
8a8012e4d2fde8fc99616feb254d22f3d3da9aa9 8a8012e4d2fde8fc99616feb254d22f3d3da9aa9
Total tests
7518
Fixed in
#1334 (Changes by Benjamin Reed)

Tests

Responsible

Code commits

OpenNMS (develop branch)
Author Commit Message Commit date
Benjamin Reed Benjamin Reed 2aaa90eb2628e1f70f56cd581e65b0398984ffd0 2aaa90eb2628e1f70f56cd581e65b0398984ffd0 Merge remote-tracking branch 'origin/release-21.1.0' into develop
Christian Pape Christian Pape bbf8ff680042c4d3291116e1a43823912eff27c2 m bbf8ff680042c4d3291116e1a43823912eff27c2 NMS-9929: Updated Karaf to version 4.1.5 (#1918)
* NMS-9929: Updated Karaf to version 4.1.5

* NMS-9929: Added documentation

* NMS-9929: Fixed Jna version

* NMS-9929: Fix integration-tests

* NMS-9929: Fix for Minion

* NMS-9929: Added reference to ${springVersion} instead of hard-coded version
OpenNMS-Repo
Author Commit Message Commit date
Benjamin Reed Benjamin Reed 457706871a1c7d1b14bb103f851c825589f59748 457706871a1c7d1b14bb103f851c825589f59748 Revert "disable symlinking _all packages to binary dirs"
This reverts commit 4a99ec2a7e7291316c5f216d9406686d5b00367b.
Benjamin Reed Benjamin Reed bfe792bb44273ce9cdb28203e50c0ab3dcb462a6 bfe792bb44273ce9cdb28203e50c0ab3dcb462a6 add "all" to the supported arches

Tests

New test failures 12
Status Test View job Duration
Collapse Failed FeatureInstallKarafIT testInstallAllOpenNMSFeatures History
Integration Test 38 secs
org.apache.karaf.features.internal.util.MultiException: Error:
 Error downloading mvn:org.apache.servicemix.bundles/org.apache.servicemix.bundles.spring-beans/4.0.9.RELEASE_1
 Error downloading mvn:org.apache.servicemix.bundles/org.apache.servicemix.bundles.spring-expression/4.0.9.RELEASE_1
 Error downloading mvn:org.apache.servicemix.bundles/org.apache.servicemix.bundles.spring-aop/4.0.9.RELEASE_1
 Error downloading mvn:org.apache.servicemix.bundles/org.apache.servicemix.bundles.spring-context-support/4.0.9.RELEASE_1
 Error downloading mvn:org.apache.servicemix.bundles/org.apache.servicemix.bundles.spring-context/4.0.9.RELEASE_1
 Error downloading mvn:org.apache.servicemix.bundles/org.apache.servicemix.bundles.spring-core/4.0.9.RELEASE_1
org.apache.karaf.features.internal.util.MultiException: Error:
(18 more lines...)
Collapse Failed MinionFeatureKarafIT testInstallFeatureOpennmsTrapdListener History
Integration Test 5 secs
org.apache.karaf.features.internal.util.MultiException: Error:
 Error downloading mvn:org.apache.servicemix.bundles/org.apache.servicemix.bundles.spring-context-support/4.0.9.RELEASE_1
 Error downloading mvn:org.apache.servicemix.bundles/org.apache.servicemix.bundles.spring-context/4.0.9.RELEASE_1
 Error downloading mvn:org.apache.servicemix.bundles/org.apache.servicemix.bundles.spring-beans/4.0.9.RELEASE_1
 Error downloading mvn:org.apache.servicemix.bundles/org.apache.servicemix.bundles.spring-expression/4.0.9.RELEASE_1
 Error downloading mvn:org.apache.servicemix.bundles/org.apache.servicemix.bundles.spring-aop/4.0.9.RELEASE_1
 Error downloading mvn:org.apache.servicemix.bundles/org.apache.servicemix.bundles.spring-core/4.0.9.RELEASE_1
org.apache.karaf.features.internal.util.MultiException: Error:
(18 more lines...)
Collapse Failed OnmsExperimentalFeaturesKarafIT testInstallFeatureOpennmsDiscovery History
Integration Test 5 secs
org.apache.karaf.features.internal.util.MultiException: Error:
 Error downloading mvn:org.apache.servicemix.bundles/org.apache.servicemix.bundles.spring-expression/4.0.9.RELEASE_1
 Error downloading mvn:org.apache.servicemix.bundles/org.apache.servicemix.bundles.spring-beans/4.0.9.RELEASE_1
 Error downloading mvn:org.apache.servicemix.bundles/org.apache.servicemix.bundles.spring-core/4.0.9.RELEASE_1
 Error downloading mvn:org.apache.servicemix.bundles/org.apache.servicemix.bundles.spring-context-support/4.0.9.RELEASE_1
 Error downloading mvn:org.apache.servicemix.bundles/org.apache.servicemix.bundles.spring-aop/4.0.9.RELEASE_1
 Error downloading mvn:org.apache.servicemix.bundles/org.apache.servicemix.bundles.spring-context/4.0.9.RELEASE_1
org.apache.karaf.features.internal.util.MultiException: Error:
(18 more lines...)
Collapse Failed OnmsExperimentalFeaturesKarafIT testInstallFeatureOpennmsActivemqComponent History
Integration Test 3 secs
org.apache.karaf.features.internal.util.MultiException: Error:
 Error downloading mvn:org.apache.servicemix.bundles/org.apache.servicemix.bundles.spring-beans/4.0.9.RELEASE_1
 Error downloading mvn:org.apache.servicemix.bundles/org.apache.servicemix.bundles.spring-context/4.0.9.RELEASE_1
 Error downloading mvn:org.apache.servicemix.bundles/org.apache.servicemix.bundles.spring-context-support/4.0.9.RELEASE_1
 Error downloading mvn:org.apache.servicemix.bundles/org.apache.servicemix.bundles.spring-core/4.0.9.RELEASE_1
 Error downloading mvn:org.apache.servicemix.bundles/org.apache.servicemix.bundles.spring-expression/4.0.9.RELEASE_1
 Error downloading mvn:org.apache.servicemix.bundles/org.apache.servicemix.bundles.spring-aop/4.0.9.RELEASE_1
org.apache.karaf.features.internal.util.MultiException: Error:
(18 more lines...)
Collapse Failed OnmsFeatureKarafIT testInstallFeatureOpennmsActivemqPool History
Integration Test 4 secs
org.apache.karaf.features.internal.util.MultiException: Error:
 Error downloading mvn:org.apache.servicemix.bundles/org.apache.servicemix.bundles.spring-aop/4.0.9.RELEASE_1
 Error downloading mvn:org.apache.servicemix.bundles/org.apache.servicemix.bundles.spring-beans/4.0.9.RELEASE_1
 Error downloading mvn:org.apache.servicemix.bundles/org.apache.servicemix.bundles.spring-context/4.0.9.RELEASE_1
 Error downloading mvn:org.apache.servicemix.bundles/org.apache.servicemix.bundles.spring-expression/4.0.9.RELEASE_1
 Error downloading mvn:org.apache.servicemix.bundles/org.apache.servicemix.bundles.spring-core/4.0.9.RELEASE_1
 Error downloading mvn:org.apache.servicemix.bundles/org.apache.servicemix.bundles.spring-context-support/4.0.9.RELEASE_1
org.apache.karaf.features.internal.util.MultiException: Error:
(18 more lines...)
Collapse Failed OnmsFeatureKarafIT testInstallFeatureOpennmsTrapd History
Integration Test 4 secs
org.apache.karaf.features.internal.util.MultiException: Error:
 Error downloading mvn:org.apache.servicemix.bundles/org.apache.servicemix.bundles.spring-context-support/4.0.9.RELEASE_1
 Error downloading mvn:org.apache.servicemix.bundles/org.apache.servicemix.bundles.spring-core/4.0.9.RELEASE_1
 Error downloading mvn:org.apache.servicemix.bundles/org.apache.servicemix.bundles.spring-beans/4.0.9.RELEASE_1
 Error downloading mvn:org.apache.servicemix.bundles/org.apache.servicemix.bundles.spring-aop/4.0.9.RELEASE_1
 Error downloading mvn:org.apache.servicemix.bundles/org.apache.servicemix.bundles.spring-expression/4.0.9.RELEASE_1
 Error downloading mvn:org.apache.servicemix.bundles/org.apache.servicemix.bundles.spring-context/4.0.9.RELEASE_1
org.apache.karaf.features.internal.util.MultiException: Error:
(18 more lines...)
Collapse Failed OnmsFeatureKarafIT testInstallFeatureOpennmsTelemetryDaemon History
Integration Test 4 secs
org.apache.karaf.features.internal.util.MultiException: Error:
 Error downloading mvn:org.apache.servicemix.bundles/org.apache.servicemix.bundles.spring-context-support/4.0.9.RELEASE_1
 Error downloading mvn:org.apache.servicemix.bundles/org.apache.servicemix.bundles.spring-aop/4.0.9.RELEASE_1
 Error downloading mvn:org.apache.servicemix.bundles/org.apache.servicemix.bundles.spring-expression/4.0.9.RELEASE_1
 Error downloading mvn:org.apache.servicemix.bundles/org.apache.servicemix.bundles.spring-core/4.0.9.RELEASE_1
 Error downloading mvn:org.apache.servicemix.bundles/org.apache.servicemix.bundles.spring-context/4.0.9.RELEASE_1
 Error downloading mvn:org.apache.servicemix.bundles/org.apache.servicemix.bundles.spring-beans/4.0.9.RELEASE_1
org.apache.karaf.features.internal.util.MultiException: Error:
(18 more lines...)
Collapse Failed OnmsFeatureKarafIT testInstallFeatureOpennmsSyslogd History
Integration Test 4 secs
org.apache.karaf.features.internal.util.MultiException: Error:
 Error downloading mvn:org.apache.servicemix.bundles/org.apache.servicemix.bundles.spring-expression/4.0.9.RELEASE_1
 Error downloading mvn:org.apache.servicemix.bundles/org.apache.servicemix.bundles.spring-beans/4.0.9.RELEASE_1
 Error downloading mvn:org.apache.servicemix.bundles/org.apache.servicemix.bundles.spring-core/4.0.9.RELEASE_1
 Error downloading mvn:org.apache.servicemix.bundles/org.apache.servicemix.bundles.spring-aop/4.0.9.RELEASE_1
 Error downloading mvn:org.apache.servicemix.bundles/org.apache.servicemix.bundles.spring-context/4.0.9.RELEASE_1
 Error downloading mvn:org.apache.servicemix.bundles/org.apache.servicemix.bundles.spring-context-support/4.0.9.RELEASE_1
org.apache.karaf.features.internal.util.MultiException: Error:
(18 more lines...)
Collapse Failed OnmsFeatureKarafIT testInstallFeatureOpennmsSyslogdListenerCamelNetty History
Integration Test 4 secs
org.apache.karaf.features.internal.util.MultiException: Error:
 Error downloading mvn:org.apache.servicemix.bundles/org.apache.servicemix.bundles.spring-expression/4.0.9.RELEASE_1
 Error downloading mvn:org.apache.servicemix.bundles/org.apache.servicemix.bundles.spring-context-support/4.0.9.RELEASE_1
 Error downloading mvn:org.apache.servicemix.bundles/org.apache.servicemix.bundles.spring-aop/4.0.9.RELEASE_1
 Error downloading mvn:org.apache.servicemix.bundles/org.apache.servicemix.bundles.spring-core/4.0.9.RELEASE_1
 Error downloading mvn:org.apache.servicemix.bundles/org.apache.servicemix.bundles.spring-context/4.0.9.RELEASE_1
 Error downloading mvn:org.apache.servicemix.bundles/org.apache.servicemix.bundles.spring-beans/4.0.9.RELEASE_1
org.apache.karaf.features.internal.util.MultiException: Error:
(18 more lines...)
Collapse Failed OnmsFeatureKarafIT testInstallFeatureOpennmsCoreDaemon History
Integration Test 3 secs
org.apache.karaf.features.internal.util.MultiException: Error:
 Error downloading mvn:org.apache.servicemix.bundles/org.apache.servicemix.bundles.spring-context-support/4.0.9.RELEASE_1
 Error downloading mvn:org.apache.servicemix.bundles/org.apache.servicemix.bundles.spring-expression/4.0.9.RELEASE_1
 Error downloading mvn:org.apache.servicemix.bundles/org.apache.servicemix.bundles.spring-aop/4.0.9.RELEASE_1
 Error downloading mvn:org.apache.servicemix.bundles/org.apache.servicemix.bundles.spring-core/4.0.9.RELEASE_1
 Error downloading mvn:org.apache.servicemix.bundles/org.apache.servicemix.bundles.spring-context/4.0.9.RELEASE_1
 Error downloading mvn:org.apache.servicemix.bundles/org.apache.servicemix.bundles.spring-beans/4.0.9.RELEASE_1
org.apache.karaf.features.internal.util.MultiException: Error:
(18 more lines...)
Collapse Failed OnmsFeatureKarafIT testInstallFeatureOpennmsSyslogdListenerJavanet History
Integration Test 4 secs
org.apache.karaf.features.internal.util.MultiException: Error:
 Error downloading mvn:org.apache.servicemix.bundles/org.apache.servicemix.bundles.spring-aop/4.0.9.RELEASE_1
 Error downloading mvn:org.apache.servicemix.bundles/org.apache.servicemix.bundles.spring-context/4.0.9.RELEASE_1
 Error downloading mvn:org.apache.servicemix.bundles/org.apache.servicemix.bundles.spring-context-support/4.0.9.RELEASE_1
 Error downloading mvn:org.apache.servicemix.bundles/org.apache.servicemix.bundles.spring-expression/4.0.9.RELEASE_1
 Error downloading mvn:org.apache.servicemix.bundles/org.apache.servicemix.bundles.spring-beans/4.0.9.RELEASE_1
 Error downloading mvn:org.apache.servicemix.bundles/org.apache.servicemix.bundles.spring-core/4.0.9.RELEASE_1
org.apache.karaf.features.internal.util.MultiException: Error:
(18 more lines...)
Collapse Failed OnmsFeatureKarafIT testInstallFeatureOpennmsDao History
Integration Test 4 secs
org.apache.karaf.features.internal.util.MultiException: Error:
 Error downloading mvn:org.apache.servicemix.bundles/org.apache.servicemix.bundles.spring-expression/4.0.9.RELEASE_1
 Error downloading mvn:org.apache.servicemix.bundles/org.apache.servicemix.bundles.spring-beans/4.0.9.RELEASE_1
 Error downloading mvn:org.apache.servicemix.bundles/org.apache.servicemix.bundles.spring-aop/4.0.9.RELEASE_1
 Error downloading mvn:org.apache.servicemix.bundles/org.apache.servicemix.bundles.spring-core/4.0.9.RELEASE_1
 Error downloading mvn:org.apache.servicemix.bundles/org.apache.servicemix.bundles.spring-context-support/4.0.9.RELEASE_1
 Error downloading mvn:org.apache.servicemix.bundles/org.apache.servicemix.bundles.spring-context/4.0.9.RELEASE_1
org.apache.karaf.features.internal.util.MultiException: Error:
(18 more lines...)

Jira issues

IssueDescriptionStatus
Unknown Issue TypeNMS-9929Could not obtain issue details from Jira