Build #81

Build: #81 failed

Job: Smoke Test (Flapping) failed

Job result summary

Completed
Duration
181 minutes
Revisions
OpenNMS (develop branch)
ed1abc7a72d8b9a56800c3060fa74601d45a4248 ed1abc7a72d8b9a56800c3060fa74601d45a4248
Smoke Tests
cb1e72265cf2ce10cb4872f58120272b340a1ce1 cb1e72265cf2ce10cb4872f58120272b340a1ce1
OpenNMS Bamboo Utils
a6d144f81c2df6f267b94e79328a0c8497980837 a6d144f81c2df6f267b94e79328a0c8497980837
OpenNMS System Test API
2baceb98eba956ca0f62f0e2d469d9f73b7ffd02 2baceb98eba956ca0f62f0e2d469d9f73b7ffd02
Total tests
220
Failing since
#30 (Code changes detected – )

Tests

  • 220 tests in total
  • 26 tests failed
  • 3 failures are new
  • 2 tests were fixed
  • 4 tests were quarantined / skipped
  • 192 minutes taken in total.
New test failures 3
Status Test Duration
Collapse Failed TopologyIT verifyNoVerticesFoundTextIsShown History
40 secs
org.openqa.selenium.NoSuchElementException: Unable to locate element: {"method":"xpath","selector":"//*/table[@class='search-token-field']//div[@class='search-token-label' and contains(text(),'Node-3')]"}
Command duration or timeout: 1.10 seconds
For documentation on this error, please visit: http://seleniumhq.org/exceptions/no_such_element.html
Build info: version: '2.53.1', revision: 'a36b8b1cd5757287168e54b817830adce9b0158d', time: '2016-06-30 19:26:09'
System info: host: 'mit.internal.opennms.com', ip: '172.20.1.205', os.name: 'Linux', os.arch: 'amd64', os.version: '4.18.0-14-generic', java.version: '1.8.0_201'
Driver info: org.openqa.selenium.firefox.FirefoxDriver
Capabilities [{applicationCacheEnabled=true, rotatable=false, handlesAlerts=true, databaseEnabled=true, version=45.0.2, platform=LINUX, nativeEvents=false, acceptSslCerts=true, webStorageEnabled=true, locationContextEnabled=true, browserName=firefox, takesScreenshot=true, javascriptEnabled=true, cssSelectorsEnabled=true}]
Session ID: 31b7b5aa-fc35-4620-8ae3-67ffcb7896f2
(18 more lines...)
Collapse Failed HealthCheckIT verifySentinelHealth History
5 mins
com.jayway.awaitility.core.ConditionTimeoutException: Condition with lambda expression in org.opennms.smoketest.health.HealthCheckIT was not fulfilled within 5 minutes.
	at org.opennms.smoketest.health.HealthCheckIT.verifyHealthCheck(HealthCheckIT.java:126)
	at org.opennms.smoketest.health.HealthCheckIT.verifySentinelHealth(HealthCheckIT.java:118)
Collapse Failed SinglePortFlowsIT verifySinglePort History
9 mins
com.jayway.awaitility.core.ConditionTimeoutException: Condition with lambda expression in org.opennms.smoketest.utils.KarafShell was not fulfilled within 5 minutes.
	at org.opennms.smoketest.sentinel.SinglePortFlowsIT.waitForSentinelStartup(SinglePortFlowsIT.java:128)
	at org.opennms.smoketest.sentinel.SinglePortFlowsIT.verifySinglePort(SinglePortFlowsIT.java:101)
Existing test failures 23
Status Test Failing since Duration
java.lang.IllegalStateException: Failed to load ApplicationContext
Caused by: java.lang.IllegalArgumentException: Cannot load an ApplicationContext with a NULL 'contextLoader'. Consider annotating your test class with @ContextConfiguration or @ContextHierarchy.
java.lang.IllegalStateException: Failed to load ApplicationContext
Caused by: java.lang.IllegalArgumentException: Cannot load an ApplicationContext with a NULL 'contextLoader'. Consider annotating your test class with @ContextConfiguration or @ContextHierarchy.
java.lang.IllegalStateException: Failed to load ApplicationContext
Caused by: java.lang.IllegalArgumentException: Cannot load an ApplicationContext with a NULL 'contextLoader'. Consider annotating your test class with @ContextConfiguration or @ContextHierarchy.
java.lang.IllegalStateException: Failed to load ApplicationContext
Caused by: java.lang.IllegalArgumentException: Cannot load an ApplicationContext with a NULL 'contextLoader'. Consider annotating your test class with @ContextConfiguration or @ContextHierarchy.
java.lang.IllegalStateException: Failed to load ApplicationContext
Caused by: java.lang.IllegalArgumentException: Cannot load an ApplicationContext with a NULL 'contextLoader'. Consider annotating your test class with @ContextConfiguration or @ContextHierarchy.
java.lang.IllegalStateException: Failed to load ApplicationContext
Caused by: java.lang.IllegalArgumentException: Cannot load an ApplicationContext with a NULL 'contextLoader'. Consider annotating your test class with @ContextConfiguration or @ContextHierarchy.
java.lang.IllegalStateException: Failed to load ApplicationContext
Caused by: java.lang.IllegalArgumentException: Cannot load an ApplicationContext with a NULL 'contextLoader'. Consider annotating your test class with @ContextConfiguration or @ContextHierarchy.
java.lang.IllegalStateException: Failed to load ApplicationContext
Caused by: java.lang.IllegalArgumentException: Cannot load an ApplicationContext with a NULL 'contextLoader'. Consider annotating your test class with @ContextConfiguration or @ContextHierarchy.
java.lang.IllegalStateException: Failed to load ApplicationContext
Caused by: java.lang.IllegalArgumentException: Cannot load an ApplicationContext with a NULL 'contextLoader'. Consider annotating your test class with @ContextConfiguration or @ContextHierarchy.
java.lang.IllegalStateException: Failed to load ApplicationContext
Caused by: java.lang.IllegalArgumentException: Cannot load an ApplicationContext with a NULL 'contextLoader'. Consider annotating your test class with @ContextConfiguration or @ContextHierarchy.
java.lang.IllegalStateException: Failed to load ApplicationContext
Caused by: java.lang.IllegalArgumentException: Cannot load an ApplicationContext with a NULL 'contextLoader'. Consider annotating your test class with @ContextConfiguration or @ContextHierarchy.
java.lang.IllegalStateException: Failed to load ApplicationContext
Caused by: java.lang.IllegalArgumentException: Cannot load an ApplicationContext with a NULL 'contextLoader'. Consider annotating your test class with @ContextConfiguration or @ContextHierarchy.
java.lang.IllegalStateException: Failed to load ApplicationContext
Caused by: java.lang.IllegalArgumentException: Cannot load an ApplicationContext with a NULL 'contextLoader'. Consider annotating your test class with @ContextConfiguration or @ContextHierarchy.
java.lang.IllegalStateException: Failed to load ApplicationContext
Caused by: java.lang.IllegalArgumentException: Cannot load an ApplicationContext with a NULL 'contextLoader'. Consider annotating your test class with @ContextConfiguration or @ContextHierarchy.
java.lang.IllegalStateException: Failed to load ApplicationContext
Caused by: java.lang.IllegalArgumentException: Cannot load an ApplicationContext with a NULL 'contextLoader'. Consider annotating your test class with @ContextConfiguration or @ContextHierarchy.
java.lang.IllegalStateException: Failed to load ApplicationContext
Caused by: java.lang.IllegalArgumentException: Cannot load an ApplicationContext with a NULL 'contextLoader'. Consider annotating your test class with @ContextConfiguration or @ContextHierarchy.
java.lang.IllegalStateException: Failed to load ApplicationContext
Caused by: java.lang.IllegalArgumentException: Cannot load an ApplicationContext with a NULL 'contextLoader'. Consider annotating your test class with @ContextConfiguration or @ContextHierarchy.
java.lang.IllegalStateException: Failed to load ApplicationContext
Caused by: java.lang.IllegalArgumentException: Cannot load an ApplicationContext with a NULL 'contextLoader'. Consider annotating your test class with @ContextConfiguration or @ContextHierarchy.
java.lang.IllegalStateException: Failed to load ApplicationContext
Caused by: java.lang.IllegalArgumentException: Cannot load an ApplicationContext with a NULL 'contextLoader'. Consider annotating your test class with @ContextConfiguration or @ContextHierarchy.
java.lang.IllegalStateException: Failed to load ApplicationContext
Caused by: java.lang.IllegalArgumentException: Cannot load an ApplicationContext with a NULL 'contextLoader'. Consider annotating your test class with @ContextConfiguration or @ContextHierarchy.
org.junit.ComparisonFailure: expected:<Node [my-node-1 ]at SeleniumTestGroup> but was:<Node []at SeleniumTestGroup>
	at org.opennms.smoketest.EditInRequisitionIT.testIfDeployed(EditInRequisitionIT.java:84)
org.openqa.selenium.TimeoutException: Timed out after 120 seconds waiting for org.opennms.smoketest.OpenNMSSeleniumTestCase$3@1e2c701
Build info: version: '2.53.1', revision: 'a36b8b1cd5757287168e54b817830adce9b0158d', time: '2016-06-30 19:26:09'
System info: host: 'mit.internal.opennms.com', ip: '172.20.1.205', os.name: 'Linux', os.arch: 'amd64', os.version: '4.18.0-14-generic', java.version: '1.8.0_201'
Driver info: org.openqa.selenium.firefox.FirefoxDriver
Capabilities [{applicationCacheEnabled=true, rotatable=false, handlesAlerts=true, databaseEnabled=true, version=45.0.2, platform=LINUX, nativeEvents=false, acceptSslCerts=true, webStorageEnabled=true, locationContextEnabled=true, browserName=firefox, takesScreenshot=true, javascriptEnabled=true, cssSelectorsEnabled=true}]
Session ID: 23909d13-be09-440a-b741-12ec0610f837
org.openqa.selenium.TimeoutException: 
Timed out after 120 seconds waiting for org.opennms.smoketest.OpenNMSSeleniumTestCase$3@1e2c701
(6 more lines...)
org.openqa.selenium.TimeoutException: Timed out after 120 seconds waiting for org.opennms.smoketest.OpenNMSSeleniumTestCase$3@3de7a229
Build info: version: '2.53.1', revision: 'a36b8b1cd5757287168e54b817830adce9b0158d', time: '2016-06-30 19:26:09'
System info: host: 'mit.internal.opennms.com', ip: '172.20.1.205', os.name: 'Linux', os.arch: 'amd64', os.version: '4.18.0-14-generic', java.version: '1.8.0_201'
Driver info: org.openqa.selenium.firefox.FirefoxDriver
Capabilities [{applicationCacheEnabled=true, rotatable=false, handlesAlerts=true, databaseEnabled=true, version=45.0.2, platform=LINUX, nativeEvents=false, acceptSslCerts=true, webStorageEnabled=true, locationContextEnabled=true, browserName=firefox, takesScreenshot=true, javascriptEnabled=true, cssSelectorsEnabled=true}]
Session ID: b8e27cb5-f972-4db7-bfdc-4ba1dd353627
org.openqa.selenium.TimeoutException: 
Timed out after 120 seconds waiting for org.opennms.smoketest.OpenNMSSeleniumTestCase$3@3de7a229
(6 more lines...)
Fixed tests 2
Status Test Failing since Duration
Successful XRequestedWithRestIT verifyWWWAuthenticate History
Failing since build #80 (Code changes detected) 17 secs
Successful SFlowTelemetryAdapterIT verifyAdapter History
Failing since build #80 (Code changes detected) 4 mins

Error summary

The build generated some errors. See the full build log for more details.

No Match for argument: opennms-upgrade
No Match for argument: meridian-upgrade
No Match for argument: opennms-docs
No Match for argument: meridian-docs
No Match for argument: opennms-core
No Match for argument: meridian-core
No Match for argument: opennms-plugin-ticketer-centric
No Match for argument: meridian-plugin-ticketer-centric
No Match for argument: opennms-source
No Match for argument: meridian-source
No Match for argument: opennms-remote-poller
No Match for argument: meridian-remote-poller
No Match for argument: opennms-minion-core
No Match for argument: meridian-minion-core
No Match for argument: opennms-minion-features
No Match for argument: meridian-minion-features
No Match for argument: opennms-minion-container
No Match for argument: meridian-minion-container
++ dirname /home/bamboo/ci/bamboo/xml-data/build-dir/OPENNMS-OF-SMOKEFLAP/.opennms-bamboo-utils/smoke-tests.sh
+ MYDIR=/home/bamboo/ci/bamboo/xml-data/build-dir/OPENNMS-OF-SMOKEFLAP/.opennms-bamboo-utils
++ cd /home/bamboo/ci/bamboo/xml-data/build-dir/OPENNMS-OF-SMOKEFLAP/.opennms-bamboo-utils
++ pwd
+ MYDIR=/home/bamboo/ci/bamboo/xml-data/build-dir/OPENNMS-OF-SMOKEFLAP/.opennms-bamboo-utils
+ . /home/bamboo/ci/bamboo/xml-data/build-dir/OPENNMS-OF-SMOKEFLAP/.opennms-bamboo-utils/lib.sh
++ WORKDIR=/home/bamboo/ci/bamboo/xml-data/build-dir/OPENNMS-OF-SMOKEFLAP
++ shift
++ '[' -z /home/bamboo/ci/bamboo/xml-data/build-dir/OPENNMS-OF-SMOKEFLAP ']'
++ '[' '!' -d /home/bamboo/ci/bamboo/xml-data/build-dir/OPENNMS-OF-SMOKEFLAP ']'
++ '[' -z /home/bamboo/ci/bamboo/xml-data/build-dir/OPENNMS-OF-SMOKEFLAP/.opennms-bamboo-utils ']'
++ '[' '!' -d /home/bamboo/ci/bamboo/xml-data/build-dir/OPENNMS-OF-SMOKEFLAP/.opennms-bamboo-utils ']'
++ . /home/bamboo/ci/bamboo/xml-data/build-dir/OPENNMS-OF-SMOKEFLAP/.opennms-bamboo-utils/environment.sh
+++ '[' -z OPENNMS-OF-SMOKEFLAP ']'
+++ export M2_LOCAL_REPOSITORY=/home/bamboo/.m2/repository-OPENNMS-OF-SMOKEFLAP
+++ M2_LOCAL_REPOSITORY=/home/bamboo/.m2/repository-OPENNMS-OF-SMOKEFLAP
+++ export JICMP_USE_SOCK_DGRAM=1
+++ JICMP_USE_SOCK_DGRAM=1
+++ COMPILE_OPTIONS=("-DupdatePolicy=never" "-Dmaxmemory=2g" "-Dorg.ops4j.pax.url.mvn.localRepository=$M2_LOCAL_REPOSITORY" "-Daether.connector.basic.threads=1" "-Daether.connector.resumeDownloads=false" "--batch-mode" "-Dorg.slf4j.simpleLogger.log.org.apache.maven.cli.transfer.Slf4jMavenTransferListener=warn")
+++ export COMPILE_OPTIONS
+++ SKIP_TESTS=("-Dmaven.test.skip.exec=true" "-DskipITs=true")
+++ export SKIP_TESTS
+++ ENABLE_TESTS=("-Dmaven.test.skip.exec=false" "-DskipITs=false")
+++ export ENABLE_TESTS
+++ export PATH=/usr/local/bin:/home/bamboo/ci:/home/bamboo/ci/java/java-default/bin:/usr/ccs/bin:/usr/xpg4/bin:/usr/local/node/bin:/home/bamboo/ci:/home/bamboo/ci/java/java-default/bin:/usr/ccs/bin:/usr/xpg4/bin:/usr/local/node/bin:/usr/bin:/bin:/usr/local/bin:/usr/local/bin
+++ PATH=/usr/local/bin:/home/bamboo/ci:/home/bamboo/ci/java/java-default/bin:/usr/ccs/bin:/usr/xpg4/bin:/usr/local/node/bin:/home/bamboo/ci:/home/bamboo/ci/java/java-default/bin:/usr/ccs/bin:/usr/xpg4/bin:/usr/local/node/bin:/usr/bin:/bin:/usr/local/bin:/usr/local/bin
+++ export BAMBOO_BUILD_NUMBER=81
+++ BAMBOO_BUILD_NUMBER=81
+++ export BAMBOO_WORKING_DIRECTORY=/home/bamboo/ci/bamboo/xml-data/build-dir/OPENNMS-OF-SMOKEFLAP
+++ BAMBOO_WORKING_DIRECTORY=/home/bamboo/ci/bamboo/xml-data/build-dir/OPENNMS-OF-SMOKEFLAP
+++ '[' -z '' ']'
+++ MAVEN_OPTS='-Xmx2048m -XX:ReservedCodeCacheSize=512m'
++ set -euo pipefail
+ set +eo pipefail
+ FLAPPING=false
+ getopts f OPT
+ case $OPT in
+ FLAPPING=true
+ getopts f OPT
+ '[' true = true ']'
++ git grep runFlappers
++ grep IfProfileValue
++ wc -l
+ FLAPPING_TESTS=0
+ '[' 0 -gt 0 ']'
+ echo '* Running flapping tests.'
+ export PATH=/opt/firefox:/usr/local/bin:/usr/local/bin:/home/bamboo/ci:/home/bamboo/ci/java/java-default/bin:/usr/ccs/bin:/usr/xpg4/bin:/usr/local/node/bin:/home/bamboo/ci:/home/bamboo/ci/java/java-default/bin:/usr/ccs/bin:/usr/xpg4/bin:/usr/local/node/bin:/usr/bin:/bin:/usr/local/bin:/usr/local/bin
+ PATH=/opt/firefox:/usr/local/bin:/usr/local/bin:/home/bamboo/ci:/home/bamboo/ci/java/java-default/bin:/usr/ccs/bin:/usr/xpg4/bin:/usr/local/node/bin:/home/bamboo/ci:/home/bamboo/ci/java/java-default/bin:/usr/ccs/bin:/usr/xpg4/bin:/usr/local/node/bin:/usr/bin:/bin:/usr/local/bin:/usr/local/bin
+ export PHANTOMJS_CDNURL=https://mirror.internal.opennms.com/phantomjs/
+ PHANTOMJS_CDNURL=https://mirror.internal.opennms.com/phantomjs/
+ '[' -x /home/bamboo/ci/bamboo/xml-data/build-dir/OPENNMS-OF-SMOKEFLAP/opennms-source/bin/javahome.pl ']'
++ /home/bamboo/ci/bamboo/xml-data/build-dir/OPENNMS-OF-SMOKEFLAP/opennms-source/bin/javahome.pl
+ JAVA_HOME=/usr/lib/jvm/java-8-oracle
+ export JAVA_HOME
++ find rpms -name 'opennms-core-*.rpm' -o -name 'meridian-core-*.rpm'
+ CORE_RPM=rpms/opennms-core-24.0.0-0.20190201.of.develop.81.noarch.rpm
++ echo rpms/opennms-core-24.0.0-0.20190201.of.develop.81.noarch.rpm
++ wc -w
+ '[' 1 -ne 1 ']'
++ rpm -q '--queryformat=%{version}-%{release}\n' -p rpms/opennms-core-24.0.0-0.20190201.of.develop.81.noarch.rpm
+ RPM_VERSION=24.0.0-0.20190201.of.develop.81
+ echo 'RPM Version: 24.0.0-0.20190201.of.develop.81'
+ ls -1 /home/bamboo/ci/bamboo/xml-data/build-dir/OPENNMS-OF-SMOKEFLAP/rpms/opennms-24.0.0-0.20190201.of.develop.81.noarch.rpm /home/bamboo/ci/bamboo/xml-data/build-dir/OPENNMS-OF-SMOKEFLAP/rpms/opennms-core-24.0.0-0.20190201.of.develop.81.noarch.rpm /home/bamboo/ci/bamboo/xml-data/build-dir/OPENNMS-OF-SMOKEFLAP/rpms/opennms-docs-24.0.0-0.20190201.of.develop.81.noarch.rpm /home/bamboo/ci/bamboo/xml-data/build-dir/OPENNMS-OF-SMOKEFLAP/rpms/opennms-jmx-config-generator-24.0.0-0.20190201.of.develop.81.noarch.rpm /home/bamboo/ci/bamboo/xml-data/build-dir/OPENNMS-OF-SMOKEFLAP/rpms/opennms-minion-24.0.0-0.20190201.of.develop.81.noarch.rpm /home/bamboo/ci/bamboo/xml-data/build-dir/OPENNMS-OF-SMOKEFLAP/rpms/opennms-minion-container-24.0.0-0.20190201.of.develop.81.noarch.rpm /home/bamboo/ci/bamboo/xml-data/build-dir/OPENNMS-OF-SMOKEFLAP/rpms/opennms-minion-features-core-24.0.0-0.20190201.of.develop.81.noarch.rpm /home/bamboo/ci/bamboo/xml-data/build-dir/OPENNMS-OF-SMOKEFLAP/rpms/opennms-minion-features-default-24.0.0-0.20190201.of.develop.81.noarch.rpm /home/bamboo/ci/bamboo/xml-data/build-dir/OPENNMS-OF-SMOKEFLAP/rpms/opennms-plugin-collector-juniper-tca-24.0.0-0.20190201.of.develop.81.noarch.rpm /home/bamboo/ci/bamboo/xml-data/build-dir/OPENNMS-OF-SMOKEFLAP/rpms/opennms-plugin-collector-vtdxml-handler-24.0.0-0.20190201.of.develop.81.noarch.rpm /home/bamboo/ci/bamboo/xml-data/build-dir/OPENNMS-OF-SMOKEFLAP/rpms/opennms-plugin-northbounder-jms-24.0.0-0.20190201.of.develop.81.noarch.rpm /home/bamboo/ci/bamboo/xml-data/build-dir/OPENNMS-OF-SMOKEFLAP/rpms/opennms-plugin-protocol-cifs-24.0.0-0.20190201.of.develop.81.noarch.rpm /home/bamboo/ci/bamboo/xml-data/build-dir/OPENNMS-OF-SMOKEFLAP/rpms/opennms-plugin-protocol-dhcp-24.0.0-0.20190201.of.develop.81.noarch.rpm /home/bamboo/ci/bamboo/xml-data/build-dir/OPENNMS-OF-SMOKEFLAP/rpms/opennms-plugin-protocol-nsclient-24.0.0-0.20190201.of.develop.81.noarch.rpm /home/bamboo/ci/bamboo/xml-data/build-dir/OPENNMS-OF-SMOKEFLAP/rpms/opennms-plugin-protocol-radius-24.0.0-0.20190201.of.develop.81.noarch.rpm /home/bamboo/ci/bamboo/xml-data/build-dir/OPENNMS-OF-SMOKEFLAP/rpms/opennms-plugin-protocol-xmp-24.0.0-0.20190201.of.develop.81.noarch.rpm /home/bamboo/ci/bamboo/xml-data/build-dir/OPENNMS-OF-SMOKEFLAP/rpms/opennms-plugin-provisioning-dns-24.0.0-0.20190201.of.develop.81.noarch.rpm /home/bamboo/ci/bamboo/xml-data/build-dir/OPENNMS-OF-SMOKEFLAP/rpms/opennms-plugin-provisioning-rancid-24.0.0-0.20190201.of.develop.81.noarch.rpm /home/bamboo/ci/bamboo/xml-data/build-dir/OPENNMS-OF-SMOKEFLAP/rpms/opennms-plugin-provisioning-reverse-dns-24.0.0-0.20190201.of.develop.81.noarch.rpm /home/bamboo/ci/bamboo/xml-data/build-dir/OPENNMS-OF-SMOKEFLAP/rpms/opennms-plugin-provisioning-snmp-asset-24.0.0-0.20190201.of.develop.81.noarch.rpm /home/bamboo/ci/bamboo/xml-data/build-dir/OPENNMS-OF-SMOKEFLAP/rpms/opennms-plugin-provisioning-snmp-hardware-inventory-24.0.0-0.20190201.of.develop.81.noarch.rpm /home/bamboo/ci/bamboo/xml-data/build-dir/OPENNMS-OF-SMOKEFLAP/rpms/opennms-plugin-provisioning-wsman-asset-24.0.0-0.20190201.of.develop.81.noarch.rpm /home/bamboo/ci/bamboo/xml-data/build-dir/OPENNMS-OF-SMOKEFLAP/rpms/opennms-plugins-24.0.0-0.20190201.of.develop.81.noarch.rpm /home/bamboo/ci/bamboo/xml-data/build-dir/OPENNMS-OF-SMOKEFLAP/rpms/opennms-plugin-ticketer-centric-24.0.0-0.20190201.of.develop.81.noarch.rpm /home/bamboo/ci/bamboo/xml-data/build-dir/OPENNMS-OF-SMOKEFLAP/rpms/opennms-plugin-ticketer-jira-24.0.0-0.20190201.of.develop.81.noarch.rpm /home/bamboo/ci/bamboo/xml-data/build-dir/OPENNMS-OF-SMOKEFLAP/rpms/opennms-plugin-ticketer-otrs-24.0.0-0.20190201.of.develop.81.noarch.rpm /home/bamboo/ci/bamboo/xml-data/build-dir/OPENNMS-OF-SMOKEFLAP/rpms/opennms-plugin-ticketer-rt-24.0.0-0.20190201.of.develop.81.noarch.rpm /home/bamboo/ci/bamboo/xml-data/build-dir/OPENNMS-OF-SMOKEFLAP/rpms/opennms-remote-poller-24.0.0-0.20190201.of.develop.81.noarch.rpm /home/bamboo/ci/bamboo/xml-data/build-dir/OPENNMS-OF-SMOKEFLAP/rpms/opennms-sentinel-24.0.0-0.20190201.of.develop.81.noarch.rpm /home/bamboo/ci/bamboo/xml-data/build-dir/OPENNMS-OF-SMOKEFLAP/rpms/opennms-source-24.0.0-0.20190201.of.develop.81.noarch.rpm /home/bamboo/ci/bamboo/xml-data/build-dir/OPENNMS-OF-SMOKEFLAP/rpms/opennms-webapp-hawtio-24.0.0-0.20190201.of.develop.81.noarch.rpm /home/bamboo/ci/bamboo/xml-data/build-dir/OPENNMS-OF-SMOKEFLAP/rpms/opennms-webapp-jetty-24.0.0-0.20190201.of.develop.81.noarch.rpm /home/bamboo/ci/bamboo/xml-data/build-dir/OPENNMS-OF-SMOKEFLAP/rpms/opennms-webapp-remoting-24.0.0-0.20190201.of.develop.81.noarch.rpm
++ grep -C1 org.opennms.smoke.test-api /home/bamboo/ci/bamboo/xml-data/build-dir/OPENNMS-OF-SMOKEFLAP/opennms-source/smoke-test/pom.xml
++ grep '<version>'
++ sed -e 's,.*<version>,,' -e 's,</version>,,' -e 's,-SNAPSHOT$,,'
+ SMOKE_TEST_API_VERSION=2
+ case "$SMOKE_TEST_API_VERSION" in
+ DOCKERDIR=/home/bamboo/ci/bamboo/xml-data/build-dir/OPENNMS-OF-SMOKEFLAP/opennms-system-test-api/docker
+ echo '* Found Dockerized smoke tests'
+ case "$SMOKE_TEST_API_VERSION" in
+ mkdir -p /home/bamboo/ci/bamboo/xml-data/build-dir/OPENNMS-OF-SMOKEFLAP/opennms-system-test-api/docker/opennms/rpms /home/bamboo/ci/bamboo/xml-data/build-dir/OPENNMS-OF-SMOKEFLAP/opennms-system-test-api/docker/minion/rpms /home/bamboo/ci/bamboo/xml-data/build-dir/OPENNMS-OF-SMOKEFLAP/opennms-system-test-api/docker/sentinel/rpms
+ rm -rf '/home/bamboo/ci/bamboo/xml-data/build-dir/OPENNMS-OF-SMOKEFLAP/opennms-system-test-api/docker/opennms/rpms/*.rpm' '/home/bamboo/ci/bamboo/xml-data/build-dir/OPENNMS-OF-SMOKEFLAP/opennms-system-test-api/docker/minion/rpms/*.rpm' '/home/bamboo/ci/bamboo/xml-data/build-dir/OPENNMS-OF-SMOKEFLAP/opennms-system-test-api/docker/sentinel/rpms/*.rpm'
+ mv /home/bamboo/ci/bamboo/xml-data/build-dir/OPENNMS-OF-SMOKEFLAP/rpms/opennms-24.0.0-0.20190201.of.develop.81.noarch.rpm /home/bamboo/ci/bamboo/xml-data/build-dir/OPENNMS-OF-SMOKEFLAP/rpms/opennms-core-24.0.0-0.20190201.of.develop.81.noarch.rpm /home/bamboo/ci/bamboo/xml-data/build-dir/OPENNMS-OF-SMOKEFLAP/rpms/opennms-docs-24.0.0-0.20190201.of.develop.81.noarch.rpm /home/bamboo/ci/bamboo/xml-data/build-dir/OPENNMS-OF-SMOKEFLAP/rpms/opennms-jmx-config-generator-24.0.0-0.20190201.of.develop.81.noarch.rpm /home/bamboo/ci/bamboo/xml-data/build-dir/OPENNMS-OF-SMOKEFLAP/rpms/opennms-minion-24.0.0-0.20190201.of.develop.81.noarch.rpm /home/bamboo/ci/bamboo/xml-data/build-dir/OPENNMS-OF-SMOKEFLAP/rpms/opennms-minion-container-24.0.0-0.20190201.of.develop.81.noarch.rpm /home/bamboo/ci/bamboo/xml-data/build-dir/OPENNMS-OF-SMOKEFLAP/rpms/opennms-minion-features-core-24.0.0-0.20190201.of.develop.81.noarch.rpm /home/bamboo/ci/bamboo/xml-data/build-dir/OPENNMS-OF-SMOKEFLAP/rpms/opennms-minion-features-default-24.0.0-0.20190201.of.develop.81.noarch.rpm /home/bamboo/ci/bamboo/xml-data/build-dir/OPENNMS-OF-SMOKEFLAP/rpms/opennms-plugin-collector-juniper-tca-24.0.0-0.20190201.of.develop.81.noarch.rpm /home/bamboo/ci/bamboo/xml-data/build-dir/OPENNMS-OF-SMOKEFLAP/rpms/opennms-plugin-collector-vtdxml-handler-24.0.0-0.20190201.of.develop.81.noarch.rpm /home/bamboo/ci/bamboo/xml-data/build-dir/OPENNMS-OF-SMOKEFLAP/rpms/opennms-plugin-northbounder-jms-24.0.0-0.20190201.of.develop.81.noarch.rpm /home/bamboo/ci/bamboo/xml-data/build-dir/OPENNMS-OF-SMOKEFLAP/rpms/opennms-plugin-protocol-cifs-24.0.0-0.20190201.of.develop.81.noarch.rpm /home/bamboo/ci/bamboo/xml-data/build-dir/OPENNMS-OF-SMOKEFLAP/rpms/opennms-plugin-protocol-dhcp-24.0.0-0.20190201.of.develop.81.noarch.rpm /home/bamboo/ci/bamboo/xml-data/build-dir/OPENNMS-OF-SMOKEFLAP/rpms/opennms-plugin-protocol-nsclient-24.0.0-0.20190201.of.develop.81.noarch.rpm /home/bamboo/ci/bamboo/xml-data/build-dir/OPENNMS-OF-SMOKEFLAP/rpms/opennms-plugin-protocol-radius-24.0.0-0.20190201.of.develop.81.noarch.rpm /home/bamboo/ci/bamboo/xml-data/build-dir/OPENNMS-OF-SMOKEFLAP/rpms/opennms-plugin-protocol-xmp-24.0.0-0.20190201.of.develop.81.noarch.rpm /home/bamboo/ci/bamboo/xml-data/build-dir/OPENNMS-OF-SMOKEFLAP/rpms/opennms-plugin-provisioning-dns-24.0.0-0.20190201.of.develop.81.noarch.rpm /home/bamboo/ci/bamboo/xml-data/build-dir/OPENNMS-OF-SMOKEFLAP/rpms/opennms-plugin-provisioning-rancid-24.0.0-0.20190201.of.develop.81.noarch.rpm /home/bamboo/ci/bamboo/xml-data/build-dir/OPENNMS-OF-SMOKEFLAP/rpms/opennms-plugin-provisioning-reverse-dns-24.0.0-0.20190201.of.develop.81.noarch.rpm /home/bamboo/ci/bamboo/xml-data/build-dir/OPENNMS-OF-SMOKEFLAP/rpms/opennms-plugin-provisioning-snmp-asset-24.0.0-0.20190201.of.develop.81.noarch.rpm /home/bamboo/ci/bamboo/xml-data/build-dir/OPENNMS-OF-SMOKEFLAP/rpms/opennms-plugin-provisioning-snmp-hardware-inventory-24.0.0-0.20190201.of.develop.81.noarch.rpm /home/bamboo/ci/bamboo/xml-data/build-dir/OPENNMS-OF-SMOKEFLAP/rpms/opennms-plugin-provisioning-wsman-asset-24.0.0-0.20190201.of.develop.81.noarch.rpm /home/bamboo/ci/bamboo/xml-data/build-dir/OPENNMS-OF-SMOKEFLAP/rpms/opennms-plugins-24.0.0-0.20190201.of.develop.81.noarch.rpm /home/bamboo/ci/bamboo/xml-data/build-dir/OPENNMS-OF-SMOKEFLAP/rpms/opennms-plugin-ticketer-centric-24.0.0-0.20190201.of.develop.81.noarch.rpm /home/bamboo/ci/bamboo/xml-data/build-dir/OPENNMS-OF-SMOKEFLAP/rpms/opennms-plugin-ticketer-jira-24.0.0-0.20190201.of.develop.81.noarch.rpm /home/bamboo/ci/bamboo/xml-data/build-dir/OPENNMS-OF-SMOKEFLAP/rpms/opennms-plugin-ticketer-otrs-24.0.0-0.20190201.of.develop.81.noarch.rpm /home/bamboo/ci/bamboo/xml-data/build-dir/OPENNMS-OF-SMOKEFLAP/rpms/opennms-plugin-ticketer-rt-24.0.0-0.20190201.of.develop.81.noarch.rpm /home/bamboo/ci/bamboo/xml-data/build-dir/OPENNMS-OF-SMOKEFLAP/rpms/opennms-remote-poller-24.0.0-0.20190201.of.develop.81.noarch.rpm /home/bamboo/ci/bamboo/xml-data/build-dir/OPENNMS-OF-SMOKEFLAP/rpms/opennms-sentinel-24.0.0-0.20190201.of.develop.81.noarch.rpm /home/bamboo/ci/bamboo/xml-data/build-dir/OPENNMS-OF-SMOKEFLAP/rpms/opennms-source-24.0.0-0.20190201.of.develop.81.noarch.rpm /home/bamboo/ci/bamboo/xml-data/build-dir/OPENNMS-OF-SMOKEFLAP/rpms/opennms-webapp-hawtio-24.0.0-0.20190201.of.develop.81.noarch.rpm /home/bamboo/ci/bamboo/xml-data/build-dir/OPENNMS-OF-SMOKEFLAP/rpms/opennms-webapp-jetty-24.0.0-0.20190201.of.develop.81.noarch.rpm /home/bamboo/ci/bamboo/xml-data/build-dir/OPENNMS-OF-SMOKEFLAP/rpms/opennms-webapp-remoting-24.0.0-0.20190201.of.develop.81.noarch.rpm /home/bamboo/ci/bamboo/xml-data/build-dir/OPENNMS-OF-SMOKEFLAP/opennms-system-test-api/docker/opennms/rpms/
+ mv /home/bamboo/ci/bamboo/xml-data/build-dir/OPENNMS-OF-SMOKEFLAP/opennms-system-test-api/docker/opennms/rpms/opennms-minion-24.0.0-0.20190201.of.develop.81.noarch.rpm /home/bamboo/ci/bamboo/xml-data/build-dir/OPENNMS-OF-SMOKEFLAP/opennms-system-test-api/docker/opennms/rpms/opennms-minion-container-24.0.0-0.20190201.of.develop.81.noarch.rpm /home/bamboo/ci/bamboo/xml-data/build-dir/OPENNMS-OF-SMOKEFLAP/opennms-system-test-api/docker/opennms/rpms/opennms-minion-features-core-24.0.0-0.20190201.of.develop.81.noarch.rpm /home/bamboo/ci/bamboo/xml-data/build-dir/OPENNMS-OF-SMOKEFLAP/opennms-system-test-api/docker/opennms/rpms/opennms-minion-features-default-24.0.0-0.20190201.of.develop.81.noarch.rpm /home/bamboo/ci/bamboo/xml-data/build-dir/OPENNMS-OF-SMOKEFLAP/opennms-system-test-api/docker/minion/rpms/
+ mv /home/bamboo/ci/bamboo/xml-data/build-dir/OPENNMS-OF-SMOKEFLAP/opennms-system-test-api/docker/opennms/rpms/opennms-sentinel-24.0.0-0.20190201.of.develop.81.noarch.rpm /home/bamboo/ci/bamboo/xml-data/build-dir/OPENNMS-OF-SMOKEFLAP/opennms-system-test-api/docker/sentinel/rpms/
+ cd /home/bamboo/ci/bamboo/xml-data/build-dir/OPENNMS-OF-SMOKEFLAP/opennms-system-test-api/docker
+ ./build-docker-images.sh
+ cd /home/bamboo/ci/bamboo/xml-data/build-dir/OPENNMS-OF-SMOKEFLAP
+ EXTRA_ARGS=()
+ set +u
+ '[' -n 172.20.1.205 ']'
+ EXTRA_ARGS+=("-Dorg.opennms.advertised-host-address=${bamboo_capability_host_address}")
+ set -u
+ RERUNS=2
+ '[' true = true ']'
+ RERUNS=0
+ EXTRA_ARGS+=('-DrunFlappers=true')
+ cd /home/bamboo/ci/bamboo/xml-data/build-dir/OPENNMS-OF-SMOKEFLAP/opennms-source
+ ./compile.pl -Dmaven.test.skip.exec=true -Dsmoke=true --projects org.opennms:smoke-test --also-make install
+ cd smoke-test
+ xvfb-run --wait=20 '--server-args=-screen 0 1920x1080x24' --server-num=80 --auto-servernum --listen-tcp ../compile.pl -Dsurefire.rerunFailingTestsCount=0 -Dfailsafe.rerunFailingTestsCount=0 -Dorg.opennms.smoketest.logLevel=INFO -Dtest.fork.count=2 -Dorg.opennms.smoketest.docker=true -Dorg.opennms.advertised-host-address=172.20.1.205 -DrunFlappers=true -Dsmoke=true -t
+ exit 1
No Match for argument: opennms-upgrade
No Match for argument: meridian-upgrade
No Match for argument: opennms-docs
No Match for argument: meridian-docs
No Match for argument: opennms-core
No Match for argument: meridian-core
No Match for argument: opennms-plugin-ticketer-centric
No Match for argument: meridian-plugin-ticketer-centric
No Match for argument: opennms-source
No Match for argument: meridian-source
No Match for argument: opennms-remote-poller
No Match for argument: meridian-remote-poller
No Match for argument: opennms-minion-core
No Match for argument: meridian-minion-core
No Match for argument: opennms-minion-features
No Match for argument: meridian-minion-features
No Match for argument: opennms-minion-container
No Match for argument: meridian-minion-container