Build: #140 failed

Job: Smoke Test (Flapping) failed

Job result summary

Completed
Duration
283 minutes
Revisions
OpenNMS (develop branch)
2f522fcc7c37188abfae71969248532d4c374f03 2f522fcc7c37188abfae71969248532d4c374f03
Smoke Tests
cb1e72265cf2ce10cb4872f58120272b340a1ce1 cb1e72265cf2ce10cb4872f58120272b340a1ce1
OpenNMS Bamboo Utils
71b0ceaeb0e8cfd6fb2fec02bdd5de3462b24090 71b0ceaeb0e8cfd6fb2fec02bdd5de3462b24090
OpenNMS System Test API
2f3a985377db43ce9b451390b9744bac402ffbd7 2f3a985377db43ce9b451390b9744bac402ffbd7
Total tests
215
Failing since
#30 (Code changes detected – )

Tests

  • 215 tests in total
  • 21 tests failed
  • 141 tests were fixed
  • 4 tests were quarantined / skipped
  • 159 minutes taken in total.
Existing test failures 21
Status Test Failing since Duration
java.lang.IllegalStateException: Failed to load ApplicationContext
Caused by: java.lang.IllegalArgumentException: Cannot load an ApplicationContext with a NULL 'contextLoader'. Consider annotating your test class with @ContextConfiguration or @ContextHierarchy.
java.lang.IllegalStateException: Failed to load ApplicationContext
Caused by: java.lang.IllegalArgumentException: Cannot load an ApplicationContext with a NULL 'contextLoader'. Consider annotating your test class with @ContextConfiguration or @ContextHierarchy.
java.lang.IllegalStateException: Failed to load ApplicationContext
Caused by: java.lang.IllegalArgumentException: Cannot load an ApplicationContext with a NULL 'contextLoader'. Consider annotating your test class with @ContextConfiguration or @ContextHierarchy.
java.lang.IllegalStateException: Failed to load ApplicationContext
Caused by: java.lang.IllegalArgumentException: Cannot load an ApplicationContext with a NULL 'contextLoader'. Consider annotating your test class with @ContextConfiguration or @ContextHierarchy.
java.lang.IllegalStateException: Failed to load ApplicationContext
Caused by: java.lang.IllegalArgumentException: Cannot load an ApplicationContext with a NULL 'contextLoader'. Consider annotating your test class with @ContextConfiguration or @ContextHierarchy.
java.lang.IllegalStateException: Failed to load ApplicationContext
Caused by: java.lang.IllegalArgumentException: Cannot load an ApplicationContext with a NULL 'contextLoader'. Consider annotating your test class with @ContextConfiguration or @ContextHierarchy.
java.lang.IllegalStateException: Failed to load ApplicationContext
Caused by: java.lang.IllegalArgumentException: Cannot load an ApplicationContext with a NULL 'contextLoader'. Consider annotating your test class with @ContextConfiguration or @ContextHierarchy.
java.lang.IllegalStateException: Failed to load ApplicationContext
Caused by: java.lang.IllegalArgumentException: Cannot load an ApplicationContext with a NULL 'contextLoader'. Consider annotating your test class with @ContextConfiguration or @ContextHierarchy.
java.lang.IllegalStateException: Failed to load ApplicationContext
Caused by: java.lang.IllegalArgumentException: Cannot load an ApplicationContext with a NULL 'contextLoader'. Consider annotating your test class with @ContextConfiguration or @ContextHierarchy.
java.lang.IllegalStateException: Failed to load ApplicationContext
Caused by: java.lang.IllegalArgumentException: Cannot load an ApplicationContext with a NULL 'contextLoader'. Consider annotating your test class with @ContextConfiguration or @ContextHierarchy.
java.lang.IllegalStateException: Failed to load ApplicationContext
Caused by: java.lang.IllegalArgumentException: Cannot load an ApplicationContext with a NULL 'contextLoader'. Consider annotating your test class with @ContextConfiguration or @ContextHierarchy.
java.lang.IllegalStateException: Failed to load ApplicationContext
Caused by: java.lang.IllegalArgumentException: Cannot load an ApplicationContext with a NULL 'contextLoader'. Consider annotating your test class with @ContextConfiguration or @ContextHierarchy.
java.lang.IllegalStateException: Failed to load ApplicationContext
Caused by: java.lang.IllegalArgumentException: Cannot load an ApplicationContext with a NULL 'contextLoader'. Consider annotating your test class with @ContextConfiguration or @ContextHierarchy.
java.lang.IllegalStateException: Failed to load ApplicationContext
Caused by: java.lang.IllegalArgumentException: Cannot load an ApplicationContext with a NULL 'contextLoader'. Consider annotating your test class with @ContextConfiguration or @ContextHierarchy.
java.lang.IllegalStateException: Failed to load ApplicationContext
Caused by: java.lang.IllegalArgumentException: Cannot load an ApplicationContext with a NULL 'contextLoader'. Consider annotating your test class with @ContextConfiguration or @ContextHierarchy.
java.lang.IllegalStateException: Failed to load ApplicationContext
Caused by: java.lang.IllegalArgumentException: Cannot load an ApplicationContext with a NULL 'contextLoader'. Consider annotating your test class with @ContextConfiguration or @ContextHierarchy.
java.lang.IllegalStateException: Failed to load ApplicationContext
Caused by: java.lang.IllegalArgumentException: Cannot load an ApplicationContext with a NULL 'contextLoader'. Consider annotating your test class with @ContextConfiguration or @ContextHierarchy.
java.lang.IllegalStateException: Failed to load ApplicationContext
Caused by: java.lang.IllegalArgumentException: Cannot load an ApplicationContext with a NULL 'contextLoader'. Consider annotating your test class with @ContextConfiguration or @ContextHierarchy.
java.lang.IllegalStateException: Failed to load ApplicationContext
Caused by: java.lang.IllegalArgumentException: Cannot load an ApplicationContext with a NULL 'contextLoader'. Consider annotating your test class with @ContextConfiguration or @ContextHierarchy.
java.lang.IllegalStateException: Failed to load ApplicationContext
Caused by: java.lang.IllegalArgumentException: Cannot load an ApplicationContext with a NULL 'contextLoader'. Consider annotating your test class with @ContextConfiguration or @ContextHierarchy.
org.openqa.selenium.TimeoutException: Timed out after 120 seconds waiting for org.opennms.smoketest.OpenNMSSeleniumTestCase$3@62126cd9
Build info: version: '2.53.1', revision: 'a36b8b1cd5757287168e54b817830adce9b0158d', time: '2016-06-30 19:26:09'
System info: host: 'bambooagent05.internal.opennms.com', ip: '172.20.1.209', os.name: 'Linux', os.arch: 'amd64', os.version: '4.15.0-47-generic', java.version: '1.8.0_201'
Driver info: org.openqa.selenium.firefox.FirefoxDriver
Capabilities [{applicationCacheEnabled=true, rotatable=false, handlesAlerts=true, databaseEnabled=true, version=45.0.2, platform=LINUX, nativeEvents=false, acceptSslCerts=true, webStorageEnabled=true, locationContextEnabled=true, browserName=firefox, takesScreenshot=true, javascriptEnabled=true, cssSelectorsEnabled=true}]
Session ID: 95919628-91ab-458d-92cf-c31137afa8d8
org.openqa.selenium.TimeoutException: 
Timed out after 120 seconds waiting for org.opennms.smoketest.OpenNMSSeleniumTestCase$3@62126cd9
(6 more lines...)
Fixed tests 141
Status Test Failing since Duration
Successful AboutPageIT hasAllPanels History
Failing since build #139 (Code changes detected) 14 secs
Successful AboutPageIT hasContent History
Failing since build #139 (Code changes detected) 11 secs
Successful AdminDataCollectionSnmpInterfacesIT canRenderPage History
Failing since build #139 (Code changes detected) 16 secs
Successful AdminPageIT testAllLinks History
Failing since build #139 (Code changes detected) 36 secs
Successful AdminPageIT testAllTextIsPresent History
Failing since build #139 (Code changes detected) 12 secs
Successful AdminSnmpConfigForIpPageIT testCancelButton History
Failing since build #139 (Code changes detected) 14 secs
Successful AdminSnmpConfigForIpPageIT testGetIpInformation History
Failing since build #139 (Code changes detected) 24 secs
Successful AdminSnmpConfigForIpPageIT testIntegerValidation History
Failing since build #139 (Code changes detected) 1 min
Successful AdminSnmpConfigForIpPageIT testIpValidation History
Failing since build #139 (Code changes detected) 34 secs
Successful AdminSnmpConfigForIpPageIT testSaveOptions History
Failing since build #139 (Code changes detected) 29 secs
Successful AdminSnmpConfigForIpPageIT testVersionHandling History
Failing since build #139 (Code changes detected) 12 secs
Successful AdminSnmpConfigForIpPageIT verifyLocationDropdown History
Failing since build #139 (Code changes detected) 12 secs
Successful AlarmsPageIT testAlarmIdNotFoundPage History
Failing since build #139 (Code changes detected) 14 secs
Successful AlarmsPageIT testAlarmLink History
Failing since build #139 (Code changes detected) 13 secs
Successful AlarmsPageIT testAllLinks History
Failing since build #139 (Code changes detected) 13 secs
Successful AlarmsPageIT testAllTextIsPresent History
Failing since build #139 (Code changes detected) 11 secs
Successful AssetsPageForNodeIT testAssetPage History
Failing since build #139 (Code changes detected) 16 secs
Successful AssetsPageIT testAllLinks History
Failing since build #139 (Code changes detected) 14 secs
Successful AssetsPageIT testAllTextIsPresent History
Failing since build #139 (Code changes detected) 11 secs
Successful CategoriesBoxIT testCategoryLink History
Failing since build #139 (Code changes detected) 14 secs
Successful ChooseResourcesPageIT verifyGraphAll History
Failing since build #139 (Code changes detected) 27 secs
Successful ChooseResourcesPageIT verifyShowsNoResourcesBanner History
Failing since build #139 (Code changes detected) 12 secs
Successful ClassificationRulePageIT verifyClassification History
Failing since build #139 (Code changes detected) 24 secs
Successful ClassificationRulePageIT verifyErrorMessageReset History
Failing since build #139 (Code changes detected) 24 secs
Successful ClassificationRulePageIT verifyExporterFilter History
Failing since build #139 (Code changes detected) 33 secs
Successful ClassificationRulePageIT verifyReadOnlyGroup History
Failing since build #139 (Code changes detected) 42 secs
Successful ClassificationRulePageIT verifyRuleCRUD History
Failing since build #139 (Code changes detected) 30 secs
Successful ClassificationRulePageIT verifyRulePaginationAndDeleteAll History
Failing since build #139 (Code changes detected) 2 mins
Successful ClassificationRulePageIT verifySearch History
Failing since build #139 (Code changes detected) 24 secs
Successful ClassificationRulePageIT verifySettingsTab History
Failing since build #139 (Code changes detected) 42 secs
Successful ClassificationRulePageIT verifySrcValues History
Failing since build #139 (Code changes detected) 31 secs
Successful ClassificationRulePageIT verifyTabs History
Failing since build #139 (Code changes detected) 27 secs
Successful DatabaseReportBatchIT testDeliver History
Failing since build #139 (Code changes detected) 22 secs
Successful DatabaseReportBatchIT testSchedule History
Failing since build #139 (Code changes detected) 25 secs
Successful DatabaseReportIT verifyReportExecution[0] History
Failing since build #139 (Code changes detected) 28 secs
Successful DatabaseReportIT verifyReportExecution[10] History
Failing since build #139 (Code changes detected) 23 secs
Successful DatabaseReportIT verifyReportExecution[11] History
Failing since build #139 (Code changes detected) 23 secs
Successful DatabaseReportIT verifyReportExecution[12] History
Failing since build #139 (Code changes detected) 24 secs
Successful DatabaseReportIT verifyReportExecution[1] History
Failing since build #139 (Code changes detected) 23 secs
Successful DatabaseReportIT verifyReportExecution[2] History
Failing since build #139 (Code changes detected) 23 secs
Successful DatabaseReportIT verifyReportExecution[3] History
Failing since build #139 (Code changes detected) 23 secs
Successful DatabaseReportIT verifyReportExecution[4] History
Failing since build #139 (Code changes detected) 23 secs
Successful DatabaseReportIT verifyReportExecution[5] History
Failing since build #139 (Code changes detected) 23 secs
Successful DatabaseReportIT verifyReportExecution[6] History
Failing since build #139 (Code changes detected) 23 secs
Successful DatabaseReportIT verifyReportExecution[7] History
Failing since build #139 (Code changes detected) 23 secs
Successful DatabaseReportIT verifyReportExecution[8] History
Failing since build #139 (Code changes detected) 23 secs
Successful DatabaseReportIT verifyReportExecution[9] History
Failing since build #139 (Code changes detected) 23 secs
Successful EditInRequisitionIT testIfDeployed History
Failing since build #138 (Code changes detected) 17 secs
Successful EditInRequisitionIT testIfNotRequisition History
Failing since build #139 (Code changes detected) 19 secs
Successful EditInRequisitionIT testIfPending History
Failing since build #139 (Code changes detected) 22 secs

Error summary

The build generated some errors. See the full build log for more details.

No Match for argument: opennms-upgrade
No Match for argument: meridian-upgrade
No Match for argument: opennms-docs
No Match for argument: meridian-docs
No Match for argument: opennms-core
No Match for argument: meridian-core
No Match for argument: opennms-plugin-ticketer-centric
No Match for argument: meridian-plugin-ticketer-centric
No Match for argument: opennms-source
No Match for argument: meridian-source
No Match for argument: opennms-remote-poller
No Match for argument: meridian-remote-poller
No Match for argument: opennms-minion-core
No Match for argument: meridian-minion-core
No Match for argument: opennms-minion-features
No Match for argument: meridian-minion-features
No Match for argument: opennms-minion-container
No Match for argument: meridian-minion-container
++ dirname /home/bamboo/ci/bamboo/xml-data/build-dir/OPENNMS-OF-SMOKEFLAP/.opennms-bamboo-utils/smoke-tests.sh
+ MYDIR=/home/bamboo/ci/bamboo/xml-data/build-dir/OPENNMS-OF-SMOKEFLAP/.opennms-bamboo-utils
++ cd /home/bamboo/ci/bamboo/xml-data/build-dir/OPENNMS-OF-SMOKEFLAP/.opennms-bamboo-utils
++ pwd
+ MYDIR=/home/bamboo/ci/bamboo/xml-data/build-dir/OPENNMS-OF-SMOKEFLAP/.opennms-bamboo-utils
+ . /home/bamboo/ci/bamboo/xml-data/build-dir/OPENNMS-OF-SMOKEFLAP/.opennms-bamboo-utils/lib.sh
++ WORKDIR=/home/bamboo/ci/bamboo/xml-data/build-dir/OPENNMS-OF-SMOKEFLAP
++ shift
++ '[' -z /home/bamboo/ci/bamboo/xml-data/build-dir/OPENNMS-OF-SMOKEFLAP ']'
++ '[' '!' -d /home/bamboo/ci/bamboo/xml-data/build-dir/OPENNMS-OF-SMOKEFLAP ']'
++ '[' -z /home/bamboo/ci/bamboo/xml-data/build-dir/OPENNMS-OF-SMOKEFLAP/.opennms-bamboo-utils ']'
++ '[' '!' -d /home/bamboo/ci/bamboo/xml-data/build-dir/OPENNMS-OF-SMOKEFLAP/.opennms-bamboo-utils ']'
++ . /home/bamboo/ci/bamboo/xml-data/build-dir/OPENNMS-OF-SMOKEFLAP/.opennms-bamboo-utils/environment.sh
+++ '[' -z OPENNMS-OF-SMOKEFLAP ']'
+++ export M2_LOCAL_REPOSITORY=/home/bamboo/.m2/repository-OPENNMS-OF-SMOKEFLAP
+++ M2_LOCAL_REPOSITORY=/home/bamboo/.m2/repository-OPENNMS-OF-SMOKEFLAP
+++ export JICMP_USE_SOCK_DGRAM=1
+++ JICMP_USE_SOCK_DGRAM=1
+++ COMPILE_OPTIONS=("-DupdatePolicy=never" "-Dmaxmemory=4g" "-Dorg.ops4j.pax.url.mvn.localRepository=$M2_LOCAL_REPOSITORY" "-Daether.connector.basic.threads=1" "-Daether.connector.resumeDownloads=false" "--batch-mode" "-Dorg.slf4j.simpleLogger.log.org.apache.maven.cli.transfer.Slf4jMavenTransferListener=warn")
+++ export COMPILE_OPTIONS
+++ SKIP_TESTS=("-Dmaven.test.skip.exec=true" "-DskipITs=true")
+++ export SKIP_TESTS
+++ ENABLE_TESTS=("-Dmaven.test.skip.exec=false" "-DskipITs=false")
+++ export ENABLE_TESTS
+++ export PATH=/usr/local/bin:/home/bamboo/ci:/home/bamboo/ci/java/java-default/bin:/usr/ccs/bin:/usr/xpg4/bin:/usr/local/node/bin:/home/bamboo/ci:/home/bamboo/ci/java/java-default/bin:/usr/ccs/bin:/usr/xpg4/bin:/usr/local/node/bin:/usr/bin:/bin:/usr/local/bin:/usr/local/bin
+++ PATH=/usr/local/bin:/home/bamboo/ci:/home/bamboo/ci/java/java-default/bin:/usr/ccs/bin:/usr/xpg4/bin:/usr/local/node/bin:/home/bamboo/ci:/home/bamboo/ci/java/java-default/bin:/usr/ccs/bin:/usr/xpg4/bin:/usr/local/node/bin:/usr/bin:/bin:/usr/local/bin:/usr/local/bin
+++ export BAMBOO_BUILD_NUMBER=140
+++ BAMBOO_BUILD_NUMBER=140
+++ export BAMBOO_WORKING_DIRECTORY=/home/bamboo/ci/bamboo/xml-data/build-dir/OPENNMS-OF-SMOKEFLAP
+++ BAMBOO_WORKING_DIRECTORY=/home/bamboo/ci/bamboo/xml-data/build-dir/OPENNMS-OF-SMOKEFLAP
+++ '[' -z '' ']'
+++ MAVEN_OPTS='-Xmx4g -XX:ReservedCodeCacheSize=1g'
++ set -euo pipefail
+ set +eo pipefail
+ FLAPPING=false
+ getopts f OPT
+ case $OPT in
+ FLAPPING=true
+ getopts f OPT
+ '[' true = true ']'
++ grep IfProfileValue
++ wc -l
++ git grep runFlappers
+ FLAPPING_TESTS=0
+ '[' 0 -gt 0 ']'
+ echo '* Running flapping tests.'
+ export PATH=/opt/firefox:/usr/local/bin:/usr/local/bin:/home/bamboo/ci:/home/bamboo/ci/java/java-default/bin:/usr/ccs/bin:/usr/xpg4/bin:/usr/local/node/bin:/home/bamboo/ci:/home/bamboo/ci/java/java-default/bin:/usr/ccs/bin:/usr/xpg4/bin:/usr/local/node/bin:/usr/bin:/bin:/usr/local/bin:/usr/local/bin
+ PATH=/opt/firefox:/usr/local/bin:/usr/local/bin:/home/bamboo/ci:/home/bamboo/ci/java/java-default/bin:/usr/ccs/bin:/usr/xpg4/bin:/usr/local/node/bin:/home/bamboo/ci:/home/bamboo/ci/java/java-default/bin:/usr/ccs/bin:/usr/xpg4/bin:/usr/local/node/bin:/usr/bin:/bin:/usr/local/bin:/usr/local/bin
+ export PHANTOMJS_CDNURL=https://mirror.internal.opennms.com/phantomjs/
+ PHANTOMJS_CDNURL=https://mirror.internal.opennms.com/phantomjs/
+ '[' -x /home/bamboo/ci/bamboo/xml-data/build-dir/OPENNMS-OF-SMOKEFLAP/opennms-source/bin/javahome.pl ']'
++ /home/bamboo/ci/bamboo/xml-data/build-dir/OPENNMS-OF-SMOKEFLAP/opennms-source/bin/javahome.pl
+ JAVA_HOME=/usr/lib/jvm/java-8-oracle
+ export JAVA_HOME
++ find rpms -name 'opennms-core-*.rpm' -o -name 'meridian-core-*.rpm'
+ CORE_RPM=rpms/opennms-core-25.0.0-0.20190422.of.develop.140.noarch.rpm
++ echo rpms/opennms-core-25.0.0-0.20190422.of.develop.140.noarch.rpm
++ wc -w
+ '[' 1 -ne 1 ']'
++ rpm -q '--queryformat=%{version}-%{release}\n' -p rpms/opennms-core-25.0.0-0.20190422.of.develop.140.noarch.rpm
+ RPM_VERSION=25.0.0-0.20190422.of.develop.140
+ echo 'RPM Version: 25.0.0-0.20190422.of.develop.140'
+ ls -1 /home/bamboo/ci/bamboo/xml-data/build-dir/OPENNMS-OF-SMOKEFLAP/rpms/opennms-25.0.0-0.20190422.of.develop.140.noarch.rpm /home/bamboo/ci/bamboo/xml-data/build-dir/OPENNMS-OF-SMOKEFLAP/rpms/opennms-core-25.0.0-0.20190422.of.develop.140.noarch.rpm /home/bamboo/ci/bamboo/xml-data/build-dir/OPENNMS-OF-SMOKEFLAP/rpms/opennms-docs-25.0.0-0.20190422.of.develop.140.noarch.rpm /home/bamboo/ci/bamboo/xml-data/build-dir/OPENNMS-OF-SMOKEFLAP/rpms/opennms-jmx-config-generator-25.0.0-0.20190422.of.develop.140.noarch.rpm /home/bamboo/ci/bamboo/xml-data/build-dir/OPENNMS-OF-SMOKEFLAP/rpms/opennms-minion-25.0.0-0.20190422.of.develop.140.noarch.rpm /home/bamboo/ci/bamboo/xml-data/build-dir/OPENNMS-OF-SMOKEFLAP/rpms/opennms-minion-container-25.0.0-0.20190422.of.develop.140.noarch.rpm /home/bamboo/ci/bamboo/xml-data/build-dir/OPENNMS-OF-SMOKEFLAP/rpms/opennms-minion-features-core-25.0.0-0.20190422.of.develop.140.noarch.rpm /home/bamboo/ci/bamboo/xml-data/build-dir/OPENNMS-OF-SMOKEFLAP/rpms/opennms-minion-features-default-25.0.0-0.20190422.of.develop.140.noarch.rpm /home/bamboo/ci/bamboo/xml-data/build-dir/OPENNMS-OF-SMOKEFLAP/rpms/opennms-plugin-collector-juniper-tca-25.0.0-0.20190422.of.develop.140.noarch.rpm /home/bamboo/ci/bamboo/xml-data/build-dir/OPENNMS-OF-SMOKEFLAP/rpms/opennms-plugin-collector-vtdxml-handler-25.0.0-0.20190422.of.develop.140.noarch.rpm /home/bamboo/ci/bamboo/xml-data/build-dir/OPENNMS-OF-SMOKEFLAP/rpms/opennms-plugin-northbounder-jms-25.0.0-0.20190422.of.develop.140.noarch.rpm /home/bamboo/ci/bamboo/xml-data/build-dir/OPENNMS-OF-SMOKEFLAP/rpms/opennms-plugin-protocol-cifs-25.0.0-0.20190422.of.develop.140.noarch.rpm /home/bamboo/ci/bamboo/xml-data/build-dir/OPENNMS-OF-SMOKEFLAP/rpms/opennms-plugin-protocol-nsclient-25.0.0-0.20190422.of.develop.140.noarch.rpm /home/bamboo/ci/bamboo/xml-data/build-dir/OPENNMS-OF-SMOKEFLAP/rpms/opennms-plugin-protocol-radius-25.0.0-0.20190422.of.develop.140.noarch.rpm /home/bamboo/ci/bamboo/xml-data/build-dir/OPENNMS-OF-SMOKEFLAP/rpms/opennms-plugin-protocol-xmp-25.0.0-0.20190422.of.develop.140.noarch.rpm /home/bamboo/ci/bamboo/xml-data/build-dir/OPENNMS-OF-SMOKEFLAP/rpms/opennms-plugin-provisioning-dns-25.0.0-0.20190422.of.develop.140.noarch.rpm /home/bamboo/ci/bamboo/xml-data/build-dir/OPENNMS-OF-SMOKEFLAP/rpms/opennms-plugin-provisioning-rancid-25.0.0-0.20190422.of.develop.140.noarch.rpm /home/bamboo/ci/bamboo/xml-data/build-dir/OPENNMS-OF-SMOKEFLAP/rpms/opennms-plugin-provisioning-reverse-dns-25.0.0-0.20190422.of.develop.140.noarch.rpm /home/bamboo/ci/bamboo/xml-data/build-dir/OPENNMS-OF-SMOKEFLAP/rpms/opennms-plugin-provisioning-snmp-asset-25.0.0-0.20190422.of.develop.140.noarch.rpm /home/bamboo/ci/bamboo/xml-data/build-dir/OPENNMS-OF-SMOKEFLAP/rpms/opennms-plugin-provisioning-snmp-hardware-inventory-25.0.0-0.20190422.of.develop.140.noarch.rpm /home/bamboo/ci/bamboo/xml-data/build-dir/OPENNMS-OF-SMOKEFLAP/rpms/opennms-plugin-provisioning-wsman-asset-25.0.0-0.20190422.of.develop.140.noarch.rpm /home/bamboo/ci/bamboo/xml-data/build-dir/OPENNMS-OF-SMOKEFLAP/rpms/opennms-plugins-25.0.0-0.20190422.of.develop.140.noarch.rpm /home/bamboo/ci/bamboo/xml-data/build-dir/OPENNMS-OF-SMOKEFLAP/rpms/opennms-plugin-ticketer-jira-25.0.0-0.20190422.of.develop.140.noarch.rpm /home/bamboo/ci/bamboo/xml-data/build-dir/OPENNMS-OF-SMOKEFLAP/rpms/opennms-plugin-ticketer-otrs-25.0.0-0.20190422.of.develop.140.noarch.rpm /home/bamboo/ci/bamboo/xml-data/build-dir/OPENNMS-OF-SMOKEFLAP/rpms/opennms-plugin-ticketer-rt-25.0.0-0.20190422.of.develop.140.noarch.rpm /home/bamboo/ci/bamboo/xml-data/build-dir/OPENNMS-OF-SMOKEFLAP/rpms/opennms-remote-poller-25.0.0-0.20190422.of.develop.140.noarch.rpm /home/bamboo/ci/bamboo/xml-data/build-dir/OPENNMS-OF-SMOKEFLAP/rpms/opennms-sentinel-25.0.0-0.20190422.of.develop.140.noarch.rpm /home/bamboo/ci/bamboo/xml-data/build-dir/OPENNMS-OF-SMOKEFLAP/rpms/opennms-source-25.0.0-0.20190422.of.develop.140.noarch.rpm /home/bamboo/ci/bamboo/xml-data/build-dir/OPENNMS-OF-SMOKEFLAP/rpms/opennms-webapp-hawtio-25.0.0-0.20190422.of.develop.140.noarch.rpm /home/bamboo/ci/bamboo/xml-data/build-dir/OPENNMS-OF-SMOKEFLAP/rpms/opennms-webapp-jetty-25.0.0-0.20190422.of.develop.140.noarch.rpm /home/bamboo/ci/bamboo/xml-data/build-dir/OPENNMS-OF-SMOKEFLAP/rpms/opennms-webapp-remoting-25.0.0-0.20190422.of.develop.140.noarch.rpm
++ grep -C1 org.opennms.smoke.test-api /home/bamboo/ci/bamboo/xml-data/build-dir/OPENNMS-OF-SMOKEFLAP/opennms-source/smoke-test/pom.xml
++ sed -e 's,.*<version>,,' -e 's,</version>,,' -e 's,-SNAPSHOT$,,'
++ grep '<version>'
+ SMOKE_TEST_API_VERSION=2
+ case "$SMOKE_TEST_API_VERSION" in
+ DOCKERDIR=/home/bamboo/ci/bamboo/xml-data/build-dir/OPENNMS-OF-SMOKEFLAP/opennms-system-test-api/docker
+ echo '* Found Dockerized smoke tests'
+ case "$SMOKE_TEST_API_VERSION" in
+ mkdir -p /home/bamboo/ci/bamboo/xml-data/build-dir/OPENNMS-OF-SMOKEFLAP/opennms-system-test-api/docker/opennms/rpms /home/bamboo/ci/bamboo/xml-data/build-dir/OPENNMS-OF-SMOKEFLAP/opennms-system-test-api/docker/minion/rpms /home/bamboo/ci/bamboo/xml-data/build-dir/OPENNMS-OF-SMOKEFLAP/opennms-system-test-api/docker/sentinel/rpms
+ rm -rf '/home/bamboo/ci/bamboo/xml-data/build-dir/OPENNMS-OF-SMOKEFLAP/opennms-system-test-api/docker/opennms/rpms/*.rpm' '/home/bamboo/ci/bamboo/xml-data/build-dir/OPENNMS-OF-SMOKEFLAP/opennms-system-test-api/docker/minion/rpms/*.rpm' '/home/bamboo/ci/bamboo/xml-data/build-dir/OPENNMS-OF-SMOKEFLAP/opennms-system-test-api/docker/sentinel/rpms/*.rpm'
+ mv /home/bamboo/ci/bamboo/xml-data/build-dir/OPENNMS-OF-SMOKEFLAP/rpms/opennms-25.0.0-0.20190422.of.develop.140.noarch.rpm /home/bamboo/ci/bamboo/xml-data/build-dir/OPENNMS-OF-SMOKEFLAP/rpms/opennms-core-25.0.0-0.20190422.of.develop.140.noarch.rpm /home/bamboo/ci/bamboo/xml-data/build-dir/OPENNMS-OF-SMOKEFLAP/rpms/opennms-docs-25.0.0-0.20190422.of.develop.140.noarch.rpm /home/bamboo/ci/bamboo/xml-data/build-dir/OPENNMS-OF-SMOKEFLAP/rpms/opennms-jmx-config-generator-25.0.0-0.20190422.of.develop.140.noarch.rpm /home/bamboo/ci/bamboo/xml-data/build-dir/OPENNMS-OF-SMOKEFLAP/rpms/opennms-minion-25.0.0-0.20190422.of.develop.140.noarch.rpm /home/bamboo/ci/bamboo/xml-data/build-dir/OPENNMS-OF-SMOKEFLAP/rpms/opennms-minion-container-25.0.0-0.20190422.of.develop.140.noarch.rpm /home/bamboo/ci/bamboo/xml-data/build-dir/OPENNMS-OF-SMOKEFLAP/rpms/opennms-minion-features-core-25.0.0-0.20190422.of.develop.140.noarch.rpm /home/bamboo/ci/bamboo/xml-data/build-dir/OPENNMS-OF-SMOKEFLAP/rpms/opennms-minion-features-default-25.0.0-0.20190422.of.develop.140.noarch.rpm /home/bamboo/ci/bamboo/xml-data/build-dir/OPENNMS-OF-SMOKEFLAP/rpms/opennms-plugin-collector-juniper-tca-25.0.0-0.20190422.of.develop.140.noarch.rpm /home/bamboo/ci/bamboo/xml-data/build-dir/OPENNMS-OF-SMOKEFLAP/rpms/opennms-plugin-collector-vtdxml-handler-25.0.0-0.20190422.of.develop.140.noarch.rpm /home/bamboo/ci/bamboo/xml-data/build-dir/OPENNMS-OF-SMOKEFLAP/rpms/opennms-plugin-northbounder-jms-25.0.0-0.20190422.of.develop.140.noarch.rpm /home/bamboo/ci/bamboo/xml-data/build-dir/OPENNMS-OF-SMOKEFLAP/rpms/opennms-plugin-protocol-cifs-25.0.0-0.20190422.of.develop.140.noarch.rpm /home/bamboo/ci/bamboo/xml-data/build-dir/OPENNMS-OF-SMOKEFLAP/rpms/opennms-plugin-protocol-nsclient-25.0.0-0.20190422.of.develop.140.noarch.rpm /home/bamboo/ci/bamboo/xml-data/build-dir/OPENNMS-OF-SMOKEFLAP/rpms/opennms-plugin-protocol-radius-25.0.0-0.20190422.of.develop.140.noarch.rpm /home/bamboo/ci/bamboo/xml-data/build-dir/OPENNMS-OF-SMOKEFLAP/rpms/opennms-plugin-protocol-xmp-25.0.0-0.20190422.of.develop.140.noarch.rpm /home/bamboo/ci/bamboo/xml-data/build-dir/OPENNMS-OF-SMOKEFLAP/rpms/opennms-plugin-provisioning-dns-25.0.0-0.20190422.of.develop.140.noarch.rpm /home/bamboo/ci/bamboo/xml-data/build-dir/OPENNMS-OF-SMOKEFLAP/rpms/opennms-plugin-provisioning-rancid-25.0.0-0.20190422.of.develop.140.noarch.rpm /home/bamboo/ci/bamboo/xml-data/build-dir/OPENNMS-OF-SMOKEFLAP/rpms/opennms-plugin-provisioning-reverse-dns-25.0.0-0.20190422.of.develop.140.noarch.rpm /home/bamboo/ci/bamboo/xml-data/build-dir/OPENNMS-OF-SMOKEFLAP/rpms/opennms-plugin-provisioning-snmp-asset-25.0.0-0.20190422.of.develop.140.noarch.rpm /home/bamboo/ci/bamboo/xml-data/build-dir/OPENNMS-OF-SMOKEFLAP/rpms/opennms-plugin-provisioning-snmp-hardware-inventory-25.0.0-0.20190422.of.develop.140.noarch.rpm /home/bamboo/ci/bamboo/xml-data/build-dir/OPENNMS-OF-SMOKEFLAP/rpms/opennms-plugin-provisioning-wsman-asset-25.0.0-0.20190422.of.develop.140.noarch.rpm /home/bamboo/ci/bamboo/xml-data/build-dir/OPENNMS-OF-SMOKEFLAP/rpms/opennms-plugins-25.0.0-0.20190422.of.develop.140.noarch.rpm /home/bamboo/ci/bamboo/xml-data/build-dir/OPENNMS-OF-SMOKEFLAP/rpms/opennms-plugin-ticketer-jira-25.0.0-0.20190422.of.develop.140.noarch.rpm /home/bamboo/ci/bamboo/xml-data/build-dir/OPENNMS-OF-SMOKEFLAP/rpms/opennms-plugin-ticketer-otrs-25.0.0-0.20190422.of.develop.140.noarch.rpm /home/bamboo/ci/bamboo/xml-data/build-dir/OPENNMS-OF-SMOKEFLAP/rpms/opennms-plugin-ticketer-rt-25.0.0-0.20190422.of.develop.140.noarch.rpm /home/bamboo/ci/bamboo/xml-data/build-dir/OPENNMS-OF-SMOKEFLAP/rpms/opennms-remote-poller-25.0.0-0.20190422.of.develop.140.noarch.rpm /home/bamboo/ci/bamboo/xml-data/build-dir/OPENNMS-OF-SMOKEFLAP/rpms/opennms-sentinel-25.0.0-0.20190422.of.develop.140.noarch.rpm /home/bamboo/ci/bamboo/xml-data/build-dir/OPENNMS-OF-SMOKEFLAP/rpms/opennms-source-25.0.0-0.20190422.of.develop.140.noarch.rpm /home/bamboo/ci/bamboo/xml-data/build-dir/OPENNMS-OF-SMOKEFLAP/rpms/opennms-webapp-hawtio-25.0.0-0.20190422.of.develop.140.noarch.rpm /home/bamboo/ci/bamboo/xml-data/build-dir/OPENNMS-OF-SMOKEFLAP/rpms/opennms-webapp-jetty-25.0.0-0.20190422.of.develop.140.noarch.rpm /home/bamboo/ci/bamboo/xml-data/build-dir/OPENNMS-OF-SMOKEFLAP/rpms/opennms-webapp-remoting-25.0.0-0.20190422.of.develop.140.noarch.rpm /home/bamboo/ci/bamboo/xml-data/build-dir/OPENNMS-OF-SMOKEFLAP/opennms-system-test-api/docker/opennms/rpms/
+ mv /home/bamboo/ci/bamboo/xml-data/build-dir/OPENNMS-OF-SMOKEFLAP/opennms-system-test-api/docker/opennms/rpms/opennms-minion-25.0.0-0.20190422.of.develop.140.noarch.rpm /home/bamboo/ci/bamboo/xml-data/build-dir/OPENNMS-OF-SMOKEFLAP/opennms-system-test-api/docker/opennms/rpms/opennms-minion-container-25.0.0-0.20190422.of.develop.140.noarch.rpm /home/bamboo/ci/bamboo/xml-data/build-dir/OPENNMS-OF-SMOKEFLAP/opennms-system-test-api/docker/opennms/rpms/opennms-minion-features-core-25.0.0-0.20190422.of.develop.140.noarch.rpm /home/bamboo/ci/bamboo/xml-data/build-dir/OPENNMS-OF-SMOKEFLAP/opennms-system-test-api/docker/opennms/rpms/opennms-minion-features-default-25.0.0-0.20190422.of.develop.140.noarch.rpm /home/bamboo/ci/bamboo/xml-data/build-dir/OPENNMS-OF-SMOKEFLAP/opennms-system-test-api/docker/minion/rpms/
+ mv /home/bamboo/ci/bamboo/xml-data/build-dir/OPENNMS-OF-SMOKEFLAP/opennms-system-test-api/docker/opennms/rpms/opennms-sentinel-25.0.0-0.20190422.of.develop.140.noarch.rpm /home/bamboo/ci/bamboo/xml-data/build-dir/OPENNMS-OF-SMOKEFLAP/opennms-system-test-api/docker/sentinel/rpms/
+ cd /home/bamboo/ci/bamboo/xml-data/build-dir/OPENNMS-OF-SMOKEFLAP/opennms-system-test-api/docker
+ ./build-docker-images.sh
+ cd /home/bamboo/ci/bamboo/xml-data/build-dir/OPENNMS-OF-SMOKEFLAP
+ EXTRA_ARGS=()
+ set +u
+ '[' -n 172.20.1.209 ']'
+ EXTRA_ARGS+=("-Dorg.opennms.advertised-host-address=${bamboo_capability_host_address}")
+ set -u
+ RERUNS=2
+ '[' true = true ']'
+ RERUNS=0
+ EXTRA_ARGS+=('-DrunFlappers=true')
+ cd /home/bamboo/ci/bamboo/xml-data/build-dir/OPENNMS-OF-SMOKEFLAP/opennms-source
+ ./compile.pl -Dmaven.test.skip.exec=true -Dsmoke=true --projects org.opennms:smoke-test --also-make install
+ cd smoke-test
+ xvfb-run --wait=20 '--server-args=-screen 0 1920x1080x24' --server-num=80 --auto-servernum --listen-tcp ../compile.pl -Dsurefire.rerunFailingTestsCount=0 -Dfailsafe.rerunFailingTestsCount=0 -Dorg.opennms.smoketest.logLevel=INFO -Dtest.fork.count=1 -Dorg.opennms.smoketest.docker=true -Dorg.opennms.advertised-host-address=172.20.1.209 -DrunFlappers=true -Dsmoke=true -t
+ exit 1
No Match for argument: opennms-upgrade
No Match for argument: meridian-upgrade
No Match for argument: opennms-docs
No Match for argument: meridian-docs
No Match for argument: opennms-core
No Match for argument: meridian-core
No Match for argument: opennms-plugin-ticketer-centric
No Match for argument: meridian-plugin-ticketer-centric
No Match for argument: opennms-source
No Match for argument: meridian-source
No Match for argument: opennms-remote-poller
No Match for argument: meridian-remote-poller
No Match for argument: opennms-minion-core
No Match for argument: meridian-minion-core
No Match for argument: opennms-minion-features
No Match for argument: meridian-minion-features
No Match for argument: opennms-minion-container
No Match for argument: meridian-minion-container