Build: #139 failed

Job: Smoke Test (Flapping) failed

Job result summary

Completed
Duration
347 minutes
Revisions
OpenNMS (develop branch)
543bf3e04470e0aaaf62976e3deaff785c06ed75 543bf3e04470e0aaaf62976e3deaff785c06ed75
Smoke Tests
cb1e72265cf2ce10cb4872f58120272b340a1ce1 cb1e72265cf2ce10cb4872f58120272b340a1ce1
OpenNMS Bamboo Utils
b70be705166f7ea70db4d786c4adb94c4f049e58 b70be705166f7ea70db4d786c4adb94c4f049e58
OpenNMS System Test API
2f3a985377db43ce9b451390b9744bac402ffbd7 2f3a985377db43ce9b451390b9744bac402ffbd7
Total tests
215
Failing since
#30 (Code changes detected – )

Tests

  • 215 tests in total
  • 162 tests failed
  • 139 failures are new
  • 4 tests were quarantined / skipped
  • 205 minutes taken in total.
New test failures 139
Status Test Duration
Collapse Failed AboutPageIT hasAllPanels History
49 secs
org.openqa.selenium.WebDriverException: Failed to connect to binary FirefoxBinary(/usr/bin/firefox) on port 7055; process output follows: 
-browser","l10nRegistrySources":{"toolkit":"","browser":"browser/"},"languages":["de"]},"hidden":false,"installTelemetryInfo":{"source":"app-global","method":"sideload"},"location":"app-global"}
1555737263921 addons.xpi-utils DEBUG Updating add-on states
1555737263923 addons.xpi DEBUG Calling bootstrap method startup on formautofill@mozilla.org version 1.0
1555737263924 addons.xpi DEBUG Calling bootstrap method startup on langpack-de@firefox.mozilla.org version 66.0
1555737263929 addons.xpi DEBUG Calling bootstrap method startup on langpack-en-CA@firefox.mozilla.org version 66.0
1555737263930 addons.xpi DEBUG Calling bootstrap method startup on langpack-en-GB@firefox.mozilla.org version 66.0
1555737263931 addons.xpi DEBUG Calling bootstrap method startup on langpack-en-ZA@firefox.mozilla.org version 66.0
(132 more lines...)
Collapse Failed AboutPageIT hasContent History
49 secs
org.openqa.selenium.WebDriverException: Failed to connect to binary FirefoxBinary(/usr/bin/firefox) on port 7055; process output follows: 
e-browser","l10nRegistrySources":{"toolkit":"","browser":"browser/"},"languages":["de"]},"hidden":false,"installTelemetryInfo":{"source":"app-global","method":"sideload"},"location":"app-global"}
1555737313354 addons.xpi-utils DEBUG Updating add-on states
1555737313356 addons.xpi DEBUG Calling bootstrap method startup on formautofill@mozilla.org version 1.0
1555737313358 addons.xpi DEBUG Calling bootstrap method startup on langpack-de@firefox.mozilla.org version 66.0
1555737313362 addons.xpi DEBUG Calling bootstrap method startup on langpack-en-CA@firefox.mozilla.org version 66.0
1555737313363 addons.xpi DEBUG Calling bootstrap method startup on langpack-en-GB@firefox.mozilla.org version 66.0
1555737313364 addons.xpi DEBUG Calling bootstrap method startup on langpack-en-ZA@firefox.mozilla.org version 66.0
(132 more lines...)
Collapse Failed AdminDataCollectionSnmpInterfacesIT canRenderPage History
49 secs
org.openqa.selenium.WebDriverException: Failed to connect to binary FirefoxBinary(/usr/bin/firefox) on port 7055; process output follows: 
-browser","l10nRegistrySources":{"toolkit":"","browser":"browser/"},"languages":["de"]},"hidden":false,"installTelemetryInfo":{"source":"app-global","method":"sideload"},"location":"app-global"}
1555721190803 addons.xpi-utils DEBUG Updating add-on states
1555721190805 addons.xpi DEBUG Calling bootstrap method startup on formautofill@mozilla.org version 1.0
1555721190806 addons.xpi DEBUG Calling bootstrap method startup on langpack-de@firefox.mozilla.org version 66.0
1555721190810 addons.xpi DEBUG Calling bootstrap method startup on langpack-en-CA@firefox.mozilla.org version 66.0
1555721190811 addons.xpi DEBUG Calling bootstrap method startup on langpack-en-GB@firefox.mozilla.org version 66.0
1555721190812 addons.xpi DEBUG Calling bootstrap method startup on langpack-en-ZA@firefox.mozilla.org version 66.0
(132 more lines...)
Collapse Failed AdminPageIT testAllLinks History
49 secs
org.openqa.selenium.WebDriverException: Failed to connect to binary FirefoxBinary(/usr/bin/firefox) on port 7055; process output follows: 
-browser","l10nRegistrySources":{"toolkit":"","browser":"browser/"},"languages":["de"]},"hidden":false,"installTelemetryInfo":{"source":"app-global","method":"sideload"},"location":"app-global"}
1555727241961 addons.xpi-utils DEBUG Updating add-on states
1555727241963 addons.xpi DEBUG Calling bootstrap method startup on formautofill@mozilla.org version 1.0
1555727241965 addons.xpi DEBUG Calling bootstrap method startup on langpack-de@firefox.mozilla.org version 66.0
1555727241969 addons.xpi DEBUG Calling bootstrap method startup on langpack-en-CA@firefox.mozilla.org version 66.0
1555727241970 addons.xpi DEBUG Calling bootstrap method startup on langpack-en-GB@firefox.mozilla.org version 66.0
1555727241971 addons.xpi DEBUG Calling bootstrap method startup on langpack-en-ZA@firefox.mozilla.org version 66.0
(132 more lines...)
Collapse Failed AdminPageIT testAllTextIsPresent History
49 secs
org.openqa.selenium.WebDriverException: Failed to connect to binary FirefoxBinary(/usr/bin/firefox) on port 7055; process output follows: 
-browser","l10nRegistrySources":{"toolkit":"","browser":"browser/"},"languages":["de"]},"hidden":false,"installTelemetryInfo":{"source":"app-global","method":"sideload"},"location":"app-global"}
1555727291352 addons.xpi-utils DEBUG Updating add-on states
1555727291354 addons.xpi DEBUG Calling bootstrap method startup on formautofill@mozilla.org version 1.0
1555727291355 addons.xpi DEBUG Calling bootstrap method startup on langpack-de@firefox.mozilla.org version 66.0
1555727291359 addons.xpi DEBUG Calling bootstrap method startup on langpack-en-CA@firefox.mozilla.org version 66.0
1555727291360 addons.xpi DEBUG Calling bootstrap method startup on langpack-en-GB@firefox.mozilla.org version 66.0
1555727291361 addons.xpi DEBUG Calling bootstrap method startup on langpack-en-ZA@firefox.mozilla.org version 66.0
(132 more lines...)
Collapse Failed AdminSnmpConfigForIpPageIT testCancelButton History
49 secs
org.openqa.selenium.WebDriverException: Failed to connect to binary FirefoxBinary(/usr/bin/firefox) on port 7055; process output follows: 
-browser","l10nRegistrySources":{"toolkit":"","browser":"browser/"},"languages":["de"]},"hidden":false,"installTelemetryInfo":{"source":"app-global","method":"sideload"},"location":"app-global"}
1555732674082 addons.xpi-utils DEBUG Updating add-on states
1555732674084 addons.xpi DEBUG Calling bootstrap method startup on formautofill@mozilla.org version 1.0
1555732674085 addons.xpi DEBUG Calling bootstrap method startup on langpack-de@firefox.mozilla.org version 66.0
1555732674089 addons.xpi DEBUG Calling bootstrap method startup on langpack-en-CA@firefox.mozilla.org version 66.0
1555732674091 addons.xpi DEBUG Calling bootstrap method startup on langpack-en-GB@firefox.mozilla.org version 66.0
1555732674092 addons.xpi DEBUG Calling bootstrap method startup on langpack-en-ZA@firefox.mozilla.org version 66.0
(132 more lines...)
Collapse Failed AdminSnmpConfigForIpPageIT testGetIpInformation History
49 secs
org.openqa.selenium.WebDriverException: Failed to connect to binary FirefoxBinary(/usr/bin/firefox) on port 7055; process output follows: 
-browser","l10nRegistrySources":{"toolkit":"","browser":"browser/"},"languages":["de"]},"hidden":false,"installTelemetryInfo":{"source":"app-global","method":"sideload"},"location":"app-global"}
1555732723448 addons.xpi-utils DEBUG Updating add-on states
1555732723450 addons.xpi DEBUG Calling bootstrap method startup on formautofill@mozilla.org version 1.0
1555732723452 addons.xpi DEBUG Calling bootstrap method startup on langpack-de@firefox.mozilla.org version 66.0
1555732723456 addons.xpi DEBUG Calling bootstrap method startup on langpack-en-CA@firefox.mozilla.org version 66.0
1555732723457 addons.xpi DEBUG Calling bootstrap method startup on langpack-en-GB@firefox.mozilla.org version 66.0
1555732723458 addons.xpi DEBUG Calling bootstrap method startup on langpack-en-ZA@firefox.mozilla.org version 66.0
(132 more lines...)
Collapse Failed AdminSnmpConfigForIpPageIT testIntegerValidation History
49 secs
org.openqa.selenium.WebDriverException: Failed to connect to binary FirefoxBinary(/usr/bin/firefox) on port 7055; process output follows: 
-browser","l10nRegistrySources":{"toolkit":"","browser":"browser/"},"languages":["de"]},"hidden":false,"installTelemetryInfo":{"source":"app-global","method":"sideload"},"location":"app-global"}
1555732772693 addons.xpi-utils DEBUG Updating add-on states
1555732772695 addons.xpi DEBUG Calling bootstrap method startup on formautofill@mozilla.org version 1.0
1555732772697 addons.xpi DEBUG Calling bootstrap method startup on langpack-de@firefox.mozilla.org version 66.0
1555732772701 addons.xpi DEBUG Calling bootstrap method startup on langpack-en-CA@firefox.mozilla.org version 66.0
1555732772702 addons.xpi DEBUG Calling bootstrap method startup on langpack-en-GB@firefox.mozilla.org version 66.0
1555732772703 addons.xpi DEBUG Calling bootstrap method startup on langpack-en-ZA@firefox.mozilla.org version 66.0
(132 more lines...)
Collapse Failed AdminSnmpConfigForIpPageIT testIpValidation History
49 secs
org.openqa.selenium.WebDriverException: Failed to connect to binary FirefoxBinary(/usr/bin/firefox) on port 7055; process output follows: 
e-browser","l10nRegistrySources":{"toolkit":"","browser":"browser/"},"languages":["de"]},"hidden":false,"installTelemetryInfo":{"source":"app-global","method":"sideload"},"location":"app-global"}
1555732821910 addons.xpi-utils DEBUG Updating add-on states
1555732821912 addons.xpi DEBUG Calling bootstrap method startup on formautofill@mozilla.org version 1.0
1555732821913 addons.xpi DEBUG Calling bootstrap method startup on langpack-de@firefox.mozilla.org version 66.0
1555732821917 addons.xpi DEBUG Calling bootstrap method startup on langpack-en-CA@firefox.mozilla.org version 66.0
1555732821918 addons.xpi DEBUG Calling bootstrap method startup on langpack-en-GB@firefox.mozilla.org version 66.0
1555732821919 addons.xpi DEBUG Calling bootstrap method startup on langpack-en-ZA@firefox.mozilla.org version 66.0
(132 more lines...)
Collapse Failed AdminSnmpConfigForIpPageIT testSaveOptions History
49 secs
org.openqa.selenium.WebDriverException: Failed to connect to binary FirefoxBinary(/usr/bin/firefox) on port 7055; process output follows: 
-browser","l10nRegistrySources":{"toolkit":"","browser":"browser/"},"languages":["de"]},"hidden":false,"installTelemetryInfo":{"source":"app-global","method":"sideload"},"location":"app-global"}
1555732871192 addons.xpi-utils DEBUG Updating add-on states
1555732871195 addons.xpi DEBUG Calling bootstrap method startup on formautofill@mozilla.org version 1.0
1555732871196 addons.xpi DEBUG Calling bootstrap method startup on langpack-de@firefox.mozilla.org version 66.0
1555732871200 addons.xpi DEBUG Calling bootstrap method startup on langpack-en-CA@firefox.mozilla.org version 66.0
1555732871201 addons.xpi DEBUG Calling bootstrap method startup on langpack-en-GB@firefox.mozilla.org version 66.0
1555732871202 addons.xpi DEBUG Calling bootstrap method startup on langpack-en-ZA@firefox.mozilla.org version 66.0
(132 more lines...)
Collapse Failed AdminSnmpConfigForIpPageIT testVersionHandling History
49 secs
org.openqa.selenium.WebDriverException: Failed to connect to binary FirefoxBinary(/usr/bin/firefox) on port 7055; process output follows: 
-browser","l10nRegistrySources":{"toolkit":"","browser":"browser/"},"languages":["de"]},"hidden":false,"installTelemetryInfo":{"source":"app-global","method":"sideload"},"location":"app-global"}
1555732920428 addons.xpi-utils DEBUG Updating add-on states
1555732920430 addons.xpi DEBUG Calling bootstrap method startup on formautofill@mozilla.org version 1.0
1555732920431 addons.xpi DEBUG Calling bootstrap method startup on langpack-de@firefox.mozilla.org version 66.0
1555732920435 addons.xpi DEBUG Calling bootstrap method startup on langpack-en-CA@firefox.mozilla.org version 66.0
1555732920436 addons.xpi DEBUG Calling bootstrap method startup on langpack-en-GB@firefox.mozilla.org version 66.0
1555732920437 addons.xpi DEBUG Calling bootstrap method startup on langpack-en-ZA@firefox.mozilla.org version 66.0
(132 more lines...)
Collapse Failed AdminSnmpConfigForIpPageIT verifyLocationDropdown History
49 secs
org.openqa.selenium.WebDriverException: Failed to connect to binary FirefoxBinary(/usr/bin/firefox) on port 7055; process output follows: 
-browser","l10nRegistrySources":{"toolkit":"","browser":"browser/"},"languages":["de"]},"hidden":false,"installTelemetryInfo":{"source":"app-global","method":"sideload"},"location":"app-global"}
1555732969654 addons.xpi-utils DEBUG Updating add-on states
1555732969656 addons.xpi DEBUG Calling bootstrap method startup on formautofill@mozilla.org version 1.0
1555732969657 addons.xpi DEBUG Calling bootstrap method startup on langpack-de@firefox.mozilla.org version 66.0
1555732969661 addons.xpi DEBUG Calling bootstrap method startup on langpack-en-CA@firefox.mozilla.org version 66.0
1555732969662 addons.xpi DEBUG Calling bootstrap method startup on langpack-en-GB@firefox.mozilla.org version 66.0
1555732969663 addons.xpi DEBUG Calling bootstrap method startup on langpack-en-ZA@firefox.mozilla.org version 66.0
(132 more lines...)
Collapse Failed AlarmsPageIT testAlarmIdNotFoundPage History
49 secs
org.openqa.selenium.WebDriverException: Failed to connect to binary FirefoxBinary(/usr/bin/firefox) on port 7055; process output follows: 
-browser","l10nRegistrySources":{"toolkit":"","browser":"browser/"},"languages":["de"]},"hidden":false,"installTelemetryInfo":{"source":"app-global","method":"sideload"},"location":"app-global"}
1555728037504 addons.xpi-utils DEBUG Updating add-on states
1555728037506 addons.xpi DEBUG Calling bootstrap method startup on formautofill@mozilla.org version 1.0
1555728037507 addons.xpi DEBUG Calling bootstrap method startup on langpack-de@firefox.mozilla.org version 66.0
1555728037512 addons.xpi DEBUG Calling bootstrap method startup on langpack-en-CA@firefox.mozilla.org version 66.0
1555728037513 addons.xpi DEBUG Calling bootstrap method startup on langpack-en-GB@firefox.mozilla.org version 66.0
1555728037514 addons.xpi DEBUG Calling bootstrap method startup on langpack-en-ZA@firefox.mozilla.org version 66.0
(132 more lines...)
Collapse Failed AlarmsPageIT testAlarmLink History
49 secs
org.openqa.selenium.WebDriverException: Failed to connect to binary FirefoxBinary(/usr/bin/firefox) on port 7055; process output follows: 
-browser","l10nRegistrySources":{"toolkit":"","browser":"browser/"},"languages":["de"]},"hidden":false,"installTelemetryInfo":{"source":"app-global","method":"sideload"},"location":"app-global"}
1555728086907 addons.xpi-utils DEBUG Updating add-on states
1555728086909 addons.xpi DEBUG Calling bootstrap method startup on formautofill@mozilla.org version 1.0
1555728086910 addons.xpi DEBUG Calling bootstrap method startup on langpack-de@firefox.mozilla.org version 66.0
1555728086914 addons.xpi DEBUG Calling bootstrap method startup on langpack-en-CA@firefox.mozilla.org version 66.0
1555728086915 addons.xpi DEBUG Calling bootstrap method startup on langpack-en-GB@firefox.mozilla.org version 66.0
1555728086916 addons.xpi DEBUG Calling bootstrap method startup on langpack-en-ZA@firefox.mozilla.org version 66.0
(132 more lines...)
Collapse Failed AlarmsPageIT testAllLinks History
49 secs
org.openqa.selenium.WebDriverException: Failed to connect to binary FirefoxBinary(/usr/bin/firefox) on port 7055; process output follows: 
e-browser","l10nRegistrySources":{"toolkit":"","browser":"browser/"},"languages":["de"]},"hidden":false,"installTelemetryInfo":{"source":"app-global","method":"sideload"},"location":"app-global"}
1555728136194 addons.xpi-utils DEBUG Updating add-on states
1555728136196 addons.xpi DEBUG Calling bootstrap method startup on formautofill@mozilla.org version 1.0
1555728136198 addons.xpi DEBUG Calling bootstrap method startup on langpack-de@firefox.mozilla.org version 66.0
1555728136202 addons.xpi DEBUG Calling bootstrap method startup on langpack-en-CA@firefox.mozilla.org version 66.0
1555728136203 addons.xpi DEBUG Calling bootstrap method startup on langpack-en-GB@firefox.mozilla.org version 66.0
1555728136204 addons.xpi DEBUG Calling bootstrap method startup on langpack-en-ZA@firefox.mozilla.org version 66.0
(132 more lines...)
Collapse Failed AlarmsPageIT testAllTextIsPresent History
49 secs
org.openqa.selenium.WebDriverException: Failed to connect to binary FirefoxBinary(/usr/bin/firefox) on port 7055; process output follows: 
e-browser","l10nRegistrySources":{"toolkit":"","browser":"browser/"},"languages":["de"]},"hidden":false,"installTelemetryInfo":{"source":"app-global","method":"sideload"},"location":"app-global"}
1555728185438 addons.xpi-utils DEBUG Updating add-on states
1555728185440 addons.xpi DEBUG Calling bootstrap method startup on formautofill@mozilla.org version 1.0
1555728185441 addons.xpi DEBUG Calling bootstrap method startup on langpack-de@firefox.mozilla.org version 66.0
1555728185445 addons.xpi DEBUG Calling bootstrap method startup on langpack-en-CA@firefox.mozilla.org version 66.0
1555728185447 addons.xpi DEBUG Calling bootstrap method startup on langpack-en-GB@firefox.mozilla.org version 66.0
1555728185448 addons.xpi DEBUG Calling bootstrap method startup on langpack-en-ZA@firefox.mozilla.org version 66.0
(132 more lines...)
Collapse Failed AssetsPageForNodeIT testAssetPage History
49 secs
org.openqa.selenium.WebDriverException: Failed to connect to binary FirefoxBinary(/usr/bin/firefox) on port 7055; process output follows: 
-browser","l10nRegistrySources":{"toolkit":"","browser":"browser/"},"languages":["de"]},"hidden":false,"installTelemetryInfo":{"source":"app-global","method":"sideload"},"location":"app-global"}
1555726848908 addons.xpi-utils DEBUG Updating add-on states
1555726848910 addons.xpi DEBUG Calling bootstrap method startup on formautofill@mozilla.org version 1.0
1555726848911 addons.xpi DEBUG Calling bootstrap method startup on langpack-de@firefox.mozilla.org version 66.0
1555726848915 addons.xpi DEBUG Calling bootstrap method startup on langpack-en-CA@firefox.mozilla.org version 66.0
1555726848916 addons.xpi DEBUG Calling bootstrap method startup on langpack-en-GB@firefox.mozilla.org version 66.0
1555726848917 addons.xpi DEBUG Calling bootstrap method startup on langpack-en-ZA@firefox.mozilla.org version 66.0
(132 more lines...)
Collapse Failed AssetsPageIT testAllLinks History
49 secs
org.openqa.selenium.WebDriverException: Failed to connect to binary FirefoxBinary(/usr/bin/firefox) on port 7055; process output follows: 
e-browser","l10nRegistrySources":{"toolkit":"","browser":"browser/"},"languages":["de"]},"hidden":false,"installTelemetryInfo":{"source":"app-global","method":"sideload"},"location":"app-global"}
1555727841238 addons.xpi-utils DEBUG Updating add-on states
1555727841240 addons.xpi DEBUG Calling bootstrap method startup on formautofill@mozilla.org version 1.0
1555727841241 addons.xpi DEBUG Calling bootstrap method startup on langpack-de@firefox.mozilla.org version 66.0
1555727841245 addons.xpi DEBUG Calling bootstrap method startup on langpack-en-CA@firefox.mozilla.org version 66.0
1555727841246 addons.xpi DEBUG Calling bootstrap method startup on langpack-en-GB@firefox.mozilla.org version 66.0
1555727841247 addons.xpi DEBUG Calling bootstrap method startup on langpack-en-ZA@firefox.mozilla.org version 66.0
(132 more lines...)
Collapse Failed AssetsPageIT testAllTextIsPresent History
49 secs
org.openqa.selenium.WebDriverException: Failed to connect to binary FirefoxBinary(/usr/bin/firefox) on port 7055; process output follows: 
-browser","l10nRegistrySources":{"toolkit":"","browser":"browser/"},"languages":["de"]},"hidden":false,"installTelemetryInfo":{"source":"app-global","method":"sideload"},"location":"app-global"}
1555727890666 addons.xpi-utils DEBUG Updating add-on states
1555727890668 addons.xpi DEBUG Calling bootstrap method startup on formautofill@mozilla.org version 1.0
1555727890669 addons.xpi DEBUG Calling bootstrap method startup on langpack-de@firefox.mozilla.org version 66.0
1555727890673 addons.xpi DEBUG Calling bootstrap method startup on langpack-en-CA@firefox.mozilla.org version 66.0
1555727890674 addons.xpi DEBUG Calling bootstrap method startup on langpack-en-GB@firefox.mozilla.org version 66.0
1555727890675 addons.xpi DEBUG Calling bootstrap method startup on langpack-en-ZA@firefox.mozilla.org version 66.0
(132 more lines...)
Collapse Failed CategoriesBoxIT testCategoryLink History
49 secs
org.openqa.selenium.WebDriverException: Failed to connect to binary FirefoxBinary(/usr/bin/firefox) on port 7055; process output follows: 
-browser","l10nRegistrySources":{"toolkit":"","browser":"browser/"},"languages":["de"]},"hidden":false,"installTelemetryInfo":{"source":"app-global","method":"sideload"},"location":"app-global"}
1555737117199 addons.xpi-utils DEBUG Updating add-on states
1555737117201 addons.xpi DEBUG Calling bootstrap method startup on formautofill@mozilla.org version 1.0
1555737117203 addons.xpi DEBUG Calling bootstrap method startup on langpack-de@firefox.mozilla.org version 66.0
1555737117207 addons.xpi DEBUG Calling bootstrap method startup on langpack-en-CA@firefox.mozilla.org version 66.0
1555737117208 addons.xpi DEBUG Calling bootstrap method startup on langpack-en-GB@firefox.mozilla.org version 66.0
1555737117210 addons.xpi DEBUG Calling bootstrap method startup on langpack-en-ZA@firefox.mozilla.org version 66.0
(132 more lines...)
Collapse Failed ChooseResourcesPageIT verifyGraphAll History
50 secs
org.openqa.selenium.WebDriverException: Failed to connect to binary FirefoxBinary(/usr/bin/firefox) on port 7055; process output follows: 
-browser","l10nRegistrySources":{"toolkit":"","browser":"browser/"},"languages":["de"]},"hidden":false,"installTelemetryInfo":{"source":"app-global","method":"sideload"},"location":"app-global"}
1555736799394 addons.xpi-utils DEBUG Updating add-on states
1555736799396 addons.xpi DEBUG Calling bootstrap method startup on formautofill@mozilla.org version 1.0
1555736799398 addons.xpi DEBUG Calling bootstrap method startup on langpack-de@firefox.mozilla.org version 66.0
1555736799402 addons.xpi DEBUG Calling bootstrap method startup on langpack-en-CA@firefox.mozilla.org version 66.0
1555736799403 addons.xpi DEBUG Calling bootstrap method startup on langpack-en-GB@firefox.mozilla.org version 66.0
1555736799404 addons.xpi DEBUG Calling bootstrap method startup on langpack-en-ZA@firefox.mozilla.org version 66.0
(132 more lines...)
Collapse Failed ChooseResourcesPageIT verifyShowsNoResourcesBanner History
49 secs
org.openqa.selenium.WebDriverException: Failed to connect to binary FirefoxBinary(/usr/bin/firefox) on port 7055; process output follows: 
-browser","l10nRegistrySources":{"toolkit":"","browser":"browser/"},"languages":["de"]},"hidden":false,"installTelemetryInfo":{"source":"app-global","method":"sideload"},"location":"app-global"}
1555736850131 addons.xpi-utils DEBUG Updating add-on states
1555736850133 addons.xpi DEBUG Calling bootstrap method startup on formautofill@mozilla.org version 1.0
1555736850135 addons.xpi DEBUG Calling bootstrap method startup on langpack-de@firefox.mozilla.org version 66.0
1555736850139 addons.xpi DEBUG Calling bootstrap method startup on langpack-en-CA@firefox.mozilla.org version 66.0
1555736850140 addons.xpi DEBUG Calling bootstrap method startup on langpack-en-GB@firefox.mozilla.org version 66.0
1555736850141 addons.xpi DEBUG Calling bootstrap method startup on langpack-en-ZA@firefox.mozilla.org version 66.0
(132 more lines...)
Collapse Failed ClassificationRulePageIT verifyClassification History
49 secs
org.openqa.selenium.WebDriverException: Failed to connect to binary FirefoxBinary(/usr/bin/firefox) on port 7055; process output follows: 
-browser","l10nRegistrySources":{"toolkit":"","browser":"browser/"},"languages":["de"]},"hidden":false,"installTelemetryInfo":{"source":"app-global","method":"sideload"},"location":"app-global"}
1555729471645 addons.xpi-utils DEBUG Updating add-on states
1555729471647 addons.xpi DEBUG Calling bootstrap method startup on formautofill@mozilla.org version 1.0
1555729471648 addons.xpi DEBUG Calling bootstrap method startup on langpack-de@firefox.mozilla.org version 66.0
1555729471652 addons.xpi DEBUG Calling bootstrap method startup on langpack-en-CA@firefox.mozilla.org version 66.0
1555729471654 addons.xpi DEBUG Calling bootstrap method startup on langpack-en-GB@firefox.mozilla.org version 66.0
1555729471655 addons.xpi DEBUG Calling bootstrap method startup on langpack-en-ZA@firefox.mozilla.org version 66.0
(132 more lines...)
Collapse Failed ClassificationRulePageIT verifyErrorMessageReset History
49 secs
org.openqa.selenium.WebDriverException: Failed to connect to binary FirefoxBinary(/usr/bin/firefox) on port 7055; process output follows: 
e-browser","l10nRegistrySources":{"toolkit":"","browser":"browser/"},"languages":["de"]},"hidden":false,"installTelemetryInfo":{"source":"app-global","method":"sideload"},"location":"app-global"}
1555729570206 addons.xpi-utils DEBUG Updating add-on states
1555729570208 addons.xpi DEBUG Calling bootstrap method startup on formautofill@mozilla.org version 1.0
1555729570209 addons.xpi DEBUG Calling bootstrap method startup on langpack-de@firefox.mozilla.org version 66.0
1555729570213 addons.xpi DEBUG Calling bootstrap method startup on langpack-en-CA@firefox.mozilla.org version 66.0
1555729570214 addons.xpi DEBUG Calling bootstrap method startup on langpack-en-GB@firefox.mozilla.org version 66.0
1555729570215 addons.xpi DEBUG Calling bootstrap method startup on langpack-en-ZA@firefox.mozilla.org version 66.0
(132 more lines...)
Collapse Failed ClassificationRulePageIT verifyExporterFilter History
49 secs
org.openqa.selenium.WebDriverException: Failed to connect to binary FirefoxBinary(/usr/bin/firefox) on port 7055; process output follows: 
-browser","l10nRegistrySources":{"toolkit":"","browser":"browser/"},"languages":["de"]},"hidden":false,"installTelemetryInfo":{"source":"app-global","method":"sideload"},"location":"app-global"}
1555729865750 addons.xpi-utils DEBUG Updating add-on states
1555729865753 addons.xpi DEBUG Calling bootstrap method startup on formautofill@mozilla.org version 1.0
1555729865754 addons.xpi DEBUG Calling bootstrap method startup on langpack-de@firefox.mozilla.org version 66.0
1555729865758 addons.xpi DEBUG Calling bootstrap method startup on langpack-en-CA@firefox.mozilla.org version 66.0
1555729865759 addons.xpi DEBUG Calling bootstrap method startup on langpack-en-GB@firefox.mozilla.org version 66.0
1555729865760 addons.xpi DEBUG Calling bootstrap method startup on langpack-en-ZA@firefox.mozilla.org version 66.0
(132 more lines...)
Collapse Failed ClassificationRulePageIT verifyReadOnlyGroup History
49 secs
org.openqa.selenium.WebDriverException: Failed to connect to binary FirefoxBinary(/usr/bin/firefox) on port 7055; process output follows: 
de-browser","l10nRegistrySources":{"toolkit":"","browser":"browser/"},"languages":["de"]},"hidden":false,"installTelemetryInfo":{"source":"app-global","method":"sideload"},"location":"app-global"}
1555729767232 addons.xpi-utils DEBUG Updating add-on states
1555729767234 addons.xpi DEBUG Calling bootstrap method startup on formautofill@mozilla.org version 1.0
1555729767236 addons.xpi DEBUG Calling bootstrap method startup on langpack-de@firefox.mozilla.org version 66.0
1555729767240 addons.xpi DEBUG Calling bootstrap method startup on langpack-en-CA@firefox.mozilla.org version 66.0
1555729767241 addons.xpi DEBUG Calling bootstrap method startup on langpack-en-GB@firefox.mozilla.org version 66.0
1555729767242 addons.xpi DEBUG Calling bootstrap method startup on langpack-en-ZA@firefox.mozilla.org version 66.0
(132 more lines...)
Collapse Failed ClassificationRulePageIT verifyRuleCRUD History
49 secs
org.openqa.selenium.WebDriverException: Failed to connect to binary FirefoxBinary(/usr/bin/firefox) on port 7055; process output follows: 
-browser","l10nRegistrySources":{"toolkit":"","browser":"browser/"},"languages":["de"]},"hidden":false,"installTelemetryInfo":{"source":"app-global","method":"sideload"},"location":"app-global"}
1555729816476 addons.xpi-utils DEBUG Updating add-on states
1555729816479 addons.xpi DEBUG Calling bootstrap method startup on formautofill@mozilla.org version 1.0
1555729816480 addons.xpi DEBUG Calling bootstrap method startup on langpack-de@firefox.mozilla.org version 66.0
1555729816484 addons.xpi DEBUG Calling bootstrap method startup on langpack-en-CA@firefox.mozilla.org version 66.0
1555729816485 addons.xpi DEBUG Calling bootstrap method startup on langpack-en-GB@firefox.mozilla.org version 66.0
1555729816486 addons.xpi DEBUG Calling bootstrap method startup on langpack-en-ZA@firefox.mozilla.org version 66.0
(132 more lines...)
Collapse Failed ClassificationRulePageIT verifyRulePaginationAndDeleteAll History
49 secs
org.openqa.selenium.WebDriverException: Failed to connect to binary FirefoxBinary(/usr/bin/firefox) on port 7055; process output follows: 
-browser","l10nRegistrySources":{"toolkit":"","browser":"browser/"},"languages":["de"]},"hidden":false,"installTelemetryInfo":{"source":"app-global","method":"sideload"},"location":"app-global"}
1555729422247 addons.xpi-utils DEBUG Updating add-on states
1555729422249 addons.xpi DEBUG Calling bootstrap method startup on formautofill@mozilla.org version 1.0
1555729422251 addons.xpi DEBUG Calling bootstrap method startup on langpack-de@firefox.mozilla.org version 66.0
1555729422255 addons.xpi DEBUG Calling bootstrap method startup on langpack-en-CA@firefox.mozilla.org version 66.0
1555729422256 addons.xpi DEBUG Calling bootstrap method startup on langpack-en-GB@firefox.mozilla.org version 66.0
1555729422257 addons.xpi DEBUG Calling bootstrap method startup on langpack-en-ZA@firefox.mozilla.org version 66.0
(132 more lines...)
Collapse Failed ClassificationRulePageIT verifySearch History
49 secs
org.openqa.selenium.WebDriverException: Failed to connect to binary FirefoxBinary(/usr/bin/firefox) on port 7055; process output follows: 
-browser","l10nRegistrySources":{"toolkit":"","browser":"browser/"},"languages":["de"]},"hidden":false,"installTelemetryInfo":{"source":"app-global","method":"sideload"},"location":"app-global"}
1555729619444 addons.xpi-utils DEBUG Updating add-on states
1555729619446 addons.xpi DEBUG Calling bootstrap method startup on formautofill@mozilla.org version 1.0
1555729619448 addons.xpi DEBUG Calling bootstrap method startup on langpack-de@firefox.mozilla.org version 66.0
1555729619452 addons.xpi DEBUG Calling bootstrap method startup on langpack-en-CA@firefox.mozilla.org version 66.0
1555729619453 addons.xpi DEBUG Calling bootstrap method startup on langpack-en-GB@firefox.mozilla.org version 66.0
1555729619454 addons.xpi DEBUG Calling bootstrap method startup on langpack-en-ZA@firefox.mozilla.org version 66.0
(132 more lines...)
Collapse Failed ClassificationRulePageIT verifySettingsTab History
49 secs
org.openqa.selenium.WebDriverException: Failed to connect to binary FirefoxBinary(/usr/bin/firefox) on port 7055; process output follows: 
-browser","l10nRegistrySources":{"toolkit":"","browser":"browser/"},"languages":["de"]},"hidden":false,"installTelemetryInfo":{"source":"app-global","method":"sideload"},"location":"app-global"}
1555729668723 addons.xpi-utils DEBUG Updating add-on states
1555729668726 addons.xpi DEBUG Calling bootstrap method startup on formautofill@mozilla.org version 1.0
1555729668727 addons.xpi DEBUG Calling bootstrap method startup on langpack-de@firefox.mozilla.org version 66.0
1555729668731 addons.xpi DEBUG Calling bootstrap method startup on langpack-en-CA@firefox.mozilla.org version 66.0
1555729668732 addons.xpi DEBUG Calling bootstrap method startup on langpack-en-GB@firefox.mozilla.org version 66.0
1555729668733 addons.xpi DEBUG Calling bootstrap method startup on langpack-en-ZA@firefox.mozilla.org version 66.0
(132 more lines...)
Collapse Failed ClassificationRulePageIT verifySrcValues History
49 secs
org.openqa.selenium.WebDriverException: Failed to connect to binary FirefoxBinary(/usr/bin/firefox) on port 7055; process output follows: 
e-browser","l10nRegistrySources":{"toolkit":"","browser":"browser/"},"languages":["de"]},"hidden":false,"installTelemetryInfo":{"source":"app-global","method":"sideload"},"location":"app-global"}
1555729717956 addons.xpi-utils DEBUG Updating add-on states
1555729717958 addons.xpi DEBUG Calling bootstrap method startup on formautofill@mozilla.org version 1.0
1555729717959 addons.xpi DEBUG Calling bootstrap method startup on langpack-de@firefox.mozilla.org version 66.0
1555729717963 addons.xpi DEBUG Calling bootstrap method startup on langpack-en-CA@firefox.mozilla.org version 66.0
1555729717964 addons.xpi DEBUG Calling bootstrap method startup on langpack-en-GB@firefox.mozilla.org version 66.0
1555729717966 addons.xpi DEBUG Calling bootstrap method startup on langpack-en-ZA@firefox.mozilla.org version 66.0
(132 more lines...)
Collapse Failed ClassificationRulePageIT verifyTabs History
49 secs
org.openqa.selenium.WebDriverException: Failed to connect to binary FirefoxBinary(/usr/bin/firefox) on port 7055; process output follows: 
-browser","l10nRegistrySources":{"toolkit":"","browser":"browser/"},"languages":["de"]},"hidden":false,"installTelemetryInfo":{"source":"app-global","method":"sideload"},"location":"app-global"}
1555729520919 addons.xpi-utils DEBUG Updating add-on states
1555729520921 addons.xpi DEBUG Calling bootstrap method startup on formautofill@mozilla.org version 1.0
1555729520922 addons.xpi DEBUG Calling bootstrap method startup on langpack-de@firefox.mozilla.org version 66.0
1555729520926 addons.xpi DEBUG Calling bootstrap method startup on langpack-en-CA@firefox.mozilla.org version 66.0
1555729520928 addons.xpi DEBUG Calling bootstrap method startup on langpack-en-GB@firefox.mozilla.org version 66.0
1555729520929 addons.xpi DEBUG Calling bootstrap method startup on langpack-en-ZA@firefox.mozilla.org version 66.0
(132 more lines...)
Collapse Failed DatabaseReportBatchIT testDeliver History
49 secs
org.openqa.selenium.WebDriverException: Failed to connect to binary FirefoxBinary(/usr/bin/firefox) on port 7055; process output follows: 
-browser","l10nRegistrySources":{"toolkit":"","browser":"browser/"},"languages":["de"]},"hidden":false,"installTelemetryInfo":{"source":"app-global","method":"sideload"},"location":"app-global"}
1555732182653 addons.xpi-utils DEBUG Updating add-on states
1555732182655 addons.xpi DEBUG Calling bootstrap method startup on formautofill@mozilla.org version 1.0
1555732182656 addons.xpi DEBUG Calling bootstrap method startup on langpack-de@firefox.mozilla.org version 66.0
1555732182660 addons.xpi DEBUG Calling bootstrap method startup on langpack-en-CA@firefox.mozilla.org version 66.0
1555732182661 addons.xpi DEBUG Calling bootstrap method startup on langpack-en-GB@firefox.mozilla.org version 66.0
1555732182663 addons.xpi DEBUG Calling bootstrap method startup on langpack-en-ZA@firefox.mozilla.org version 66.0
(132 more lines...)
Collapse Failed DatabaseReportBatchIT testSchedule History
49 secs
org.openqa.selenium.WebDriverException: Failed to connect to binary FirefoxBinary(/usr/bin/firefox) on port 7055; process output follows: 
e-browser","l10nRegistrySources":{"toolkit":"","browser":"browser/"},"languages":["de"]},"hidden":false,"installTelemetryInfo":{"source":"app-global","method":"sideload"},"location":"app-global"}
1555732133259 addons.xpi-utils DEBUG Updating add-on states
1555732133261 addons.xpi DEBUG Calling bootstrap method startup on formautofill@mozilla.org version 1.0
1555732133263 addons.xpi DEBUG Calling bootstrap method startup on langpack-de@firefox.mozilla.org version 66.0
1555732133267 addons.xpi DEBUG Calling bootstrap method startup on langpack-en-CA@firefox.mozilla.org version 66.0
1555732133268 addons.xpi DEBUG Calling bootstrap method startup on langpack-en-GB@firefox.mozilla.org version 66.0
1555732133269 addons.xpi DEBUG Calling bootstrap method startup on langpack-en-ZA@firefox.mozilla.org version 66.0
(132 more lines...)
Collapse Failed DatabaseReportIT verifyReportExecution[0] History
50 secs
org.openqa.selenium.WebDriverException: Failed to connect to binary FirefoxBinary(/usr/bin/firefox) on port 7055; process output follows: 
-browser","l10nRegistrySources":{"toolkit":"","browser":"browser/"},"languages":["de"]},"hidden":false,"installTelemetryInfo":{"source":"app-global","method":"sideload"},"location":"app-global"}
1555735464865 addons.xpi-utils DEBUG Updating add-on states
1555735464867 addons.xpi DEBUG Calling bootstrap method startup on formautofill@mozilla.org version 1.0
1555735464869 addons.xpi DEBUG Calling bootstrap method startup on langpack-de@firefox.mozilla.org version 66.0
1555735464872 addons.xpi DEBUG Calling bootstrap method startup on langpack-en-CA@firefox.mozilla.org version 66.0
1555735464874 addons.xpi DEBUG Calling bootstrap method startup on langpack-en-GB@firefox.mozilla.org version 66.0
1555735464875 addons.xpi DEBUG Calling bootstrap method startup on langpack-en-ZA@firefox.mozilla.org version 66.0
(132 more lines...)
Collapse Failed DatabaseReportIT verifyReportExecution[10] History
49 secs
org.openqa.selenium.WebDriverException: Failed to connect to binary FirefoxBinary(/usr/bin/firefox) on port 7055; process output follows: 
-browser","l10nRegistrySources":{"toolkit":"","browser":"browser/"},"languages":["de"]},"hidden":false,"installTelemetryInfo":{"source":"app-global","method":"sideload"},"location":"app-global"}
1555735957573 addons.xpi-utils DEBUG Updating add-on states
1555735957575 addons.xpi DEBUG Calling bootstrap method startup on formautofill@mozilla.org version 1.0
1555735957576 addons.xpi DEBUG Calling bootstrap method startup on langpack-de@firefox.mozilla.org version 66.0
1555735957580 addons.xpi DEBUG Calling bootstrap method startup on langpack-en-CA@firefox.mozilla.org version 66.0
1555735957581 addons.xpi DEBUG Calling bootstrap method startup on langpack-en-GB@firefox.mozilla.org version 66.0
1555735957583 addons.xpi DEBUG Calling bootstrap method startup on langpack-en-ZA@firefox.mozilla.org version 66.0
(132 more lines...)
Collapse Failed DatabaseReportIT verifyReportExecution[11] History
49 secs
org.openqa.selenium.WebDriverException: Failed to connect to binary FirefoxBinary(/usr/bin/firefox) on port 7055; process output follows: 
-browser","l10nRegistrySources":{"toolkit":"","browser":"browser/"},"languages":["de"]},"hidden":false,"installTelemetryInfo":{"source":"app-global","method":"sideload"},"location":"app-global"}
1555736006900 addons.xpi-utils DEBUG Updating add-on states
1555736006902 addons.xpi DEBUG Calling bootstrap method startup on formautofill@mozilla.org version 1.0
1555736006904 addons.xpi DEBUG Calling bootstrap method startup on langpack-de@firefox.mozilla.org version 66.0
1555736006908 addons.xpi DEBUG Calling bootstrap method startup on langpack-en-CA@firefox.mozilla.org version 66.0
1555736006909 addons.xpi DEBUG Calling bootstrap method startup on langpack-en-GB@firefox.mozilla.org version 66.0
1555736006910 addons.xpi DEBUG Calling bootstrap method startup on langpack-en-ZA@firefox.mozilla.org version 66.0
(132 more lines...)
Collapse Failed DatabaseReportIT verifyReportExecution[12] History
49 secs
org.openqa.selenium.WebDriverException: Failed to connect to binary FirefoxBinary(/usr/bin/firefox) on port 7055; process output follows: 
-browser","l10nRegistrySources":{"toolkit":"","browser":"browser/"},"languages":["de"]},"hidden":false,"installTelemetryInfo":{"source":"app-global","method":"sideload"},"location":"app-global"}
1555736056120 addons.xpi-utils DEBUG Updating add-on states
1555736056122 addons.xpi DEBUG Calling bootstrap method startup on formautofill@mozilla.org version 1.0
1555736056123 addons.xpi DEBUG Calling bootstrap method startup on langpack-de@firefox.mozilla.org version 66.0
1555736056127 addons.xpi DEBUG Calling bootstrap method startup on langpack-en-CA@firefox.mozilla.org version 66.0
1555736056128 addons.xpi DEBUG Calling bootstrap method startup on langpack-en-GB@firefox.mozilla.org version 66.0
1555736056129 addons.xpi DEBUG Calling bootstrap method startup on langpack-en-ZA@firefox.mozilla.org version 66.0
(132 more lines...)
Collapse Failed DatabaseReportIT verifyReportExecution[1] History
49 secs
org.openqa.selenium.WebDriverException: Failed to connect to binary FirefoxBinary(/usr/bin/firefox) on port 7055; process output follows: 
e-browser","l10nRegistrySources":{"toolkit":"","browser":"browser/"},"languages":["de"]},"hidden":false,"installTelemetryInfo":{"source":"app-global","method":"sideload"},"location":"app-global"}
1555735514228 addons.xpi-utils DEBUG Updating add-on states
1555735514230 addons.xpi DEBUG Calling bootstrap method startup on formautofill@mozilla.org version 1.0
1555735514231 addons.xpi DEBUG Calling bootstrap method startup on langpack-de@firefox.mozilla.org version 66.0
1555735514235 addons.xpi DEBUG Calling bootstrap method startup on langpack-en-CA@firefox.mozilla.org version 66.0
1555735514237 addons.xpi DEBUG Calling bootstrap method startup on langpack-en-GB@firefox.mozilla.org version 66.0
1555735514238 addons.xpi DEBUG Calling bootstrap method startup on langpack-en-ZA@firefox.mozilla.org version 66.0
(132 more lines...)
Collapse Failed DatabaseReportIT verifyReportExecution[2] History
49 secs
org.openqa.selenium.WebDriverException: Failed to connect to binary FirefoxBinary(/usr/bin/firefox) on port 7055; process output follows: 
-browser","l10nRegistrySources":{"toolkit":"","browser":"browser/"},"languages":["de"]},"hidden":false,"installTelemetryInfo":{"source":"app-global","method":"sideload"},"location":"app-global"}
1555735563510 addons.xpi-utils DEBUG Updating add-on states
1555735563512 addons.xpi DEBUG Calling bootstrap method startup on formautofill@mozilla.org version 1.0
1555735563513 addons.xpi DEBUG Calling bootstrap method startup on langpack-de@firefox.mozilla.org version 66.0
1555735563517 addons.xpi DEBUG Calling bootstrap method startup on langpack-en-CA@firefox.mozilla.org version 66.0
1555735563519 addons.xpi DEBUG Calling bootstrap method startup on langpack-en-GB@firefox.mozilla.org version 66.0
1555735563520 addons.xpi DEBUG Calling bootstrap method startup on langpack-en-ZA@firefox.mozilla.org version 66.0
(132 more lines...)
Collapse Failed DatabaseReportIT verifyReportExecution[3] History
49 secs
org.openqa.selenium.WebDriverException: Failed to connect to binary FirefoxBinary(/usr/bin/firefox) on port 7055; process output follows: 
-browser","l10nRegistrySources":{"toolkit":"","browser":"browser/"},"languages":["de"]},"hidden":false,"installTelemetryInfo":{"source":"app-global","method":"sideload"},"location":"app-global"}
1555735612743 addons.xpi-utils DEBUG Updating add-on states
1555735612745 addons.xpi DEBUG Calling bootstrap method startup on formautofill@mozilla.org version 1.0
1555735612746 addons.xpi DEBUG Calling bootstrap method startup on langpack-de@firefox.mozilla.org version 66.0
1555735612750 addons.xpi DEBUG Calling bootstrap method startup on langpack-en-CA@firefox.mozilla.org version 66.0
1555735612751 addons.xpi DEBUG Calling bootstrap method startup on langpack-en-GB@firefox.mozilla.org version 66.0
1555735612752 addons.xpi DEBUG Calling bootstrap method startup on langpack-en-ZA@firefox.mozilla.org version 66.0
(132 more lines...)
Collapse Failed DatabaseReportIT verifyReportExecution[4] History
49 secs
org.openqa.selenium.WebDriverException: Failed to connect to binary FirefoxBinary(/usr/bin/firefox) on port 7055; process output follows: 
-browser","l10nRegistrySources":{"toolkit":"","browser":"browser/"},"languages":["de"]},"hidden":false,"installTelemetryInfo":{"source":"app-global","method":"sideload"},"location":"app-global"}
1555735662053 addons.xpi-utils DEBUG Updating add-on states
1555735662055 addons.xpi DEBUG Calling bootstrap method startup on formautofill@mozilla.org version 1.0
1555735662056 addons.xpi DEBUG Calling bootstrap method startup on langpack-de@firefox.mozilla.org version 66.0
1555735662060 addons.xpi DEBUG Calling bootstrap method startup on langpack-en-CA@firefox.mozilla.org version 66.0
1555735662061 addons.xpi DEBUG Calling bootstrap method startup on langpack-en-GB@firefox.mozilla.org version 66.0
1555735662063 addons.xpi DEBUG Calling bootstrap method startup on langpack-en-ZA@firefox.mozilla.org version 66.0
(132 more lines...)
Collapse Failed DatabaseReportIT verifyReportExecution[5] History
49 secs
org.openqa.selenium.WebDriverException: Failed to connect to binary FirefoxBinary(/usr/bin/firefox) on port 7055; process output follows: 
-browser","l10nRegistrySources":{"toolkit":"","browser":"browser/"},"languages":["de"]},"hidden":false,"installTelemetryInfo":{"source":"app-global","method":"sideload"},"location":"app-global"}
1555735711337 addons.xpi-utils DEBUG Updating add-on states
1555735711339 addons.xpi DEBUG Calling bootstrap method startup on formautofill@mozilla.org version 1.0
1555735711341 addons.xpi DEBUG Calling bootstrap method startup on langpack-de@firefox.mozilla.org version 66.0
1555735711345 addons.xpi DEBUG Calling bootstrap method startup on langpack-en-CA@firefox.mozilla.org version 66.0
1555735711346 addons.xpi DEBUG Calling bootstrap method startup on langpack-en-GB@firefox.mozilla.org version 66.0
1555735711347 addons.xpi DEBUG Calling bootstrap method startup on langpack-en-ZA@firefox.mozilla.org version 66.0
(132 more lines...)
Collapse Failed DatabaseReportIT verifyReportExecution[6] History
49 secs
org.openqa.selenium.WebDriverException: Failed to connect to binary FirefoxBinary(/usr/bin/firefox) on port 7055; process output follows: 
e-browser","l10nRegistrySources":{"toolkit":"","browser":"browser/"},"languages":["de"]},"hidden":false,"installTelemetryInfo":{"source":"app-global","method":"sideload"},"location":"app-global"}
1555735760580 addons.xpi-utils DEBUG Updating add-on states
1555735760582 addons.xpi DEBUG Calling bootstrap method startup on formautofill@mozilla.org version 1.0
1555735760584 addons.xpi DEBUG Calling bootstrap method startup on langpack-de@firefox.mozilla.org version 66.0
1555735760588 addons.xpi DEBUG Calling bootstrap method startup on langpack-en-CA@firefox.mozilla.org version 66.0
1555735760589 addons.xpi DEBUG Calling bootstrap method startup on langpack-en-GB@firefox.mozilla.org version 66.0
1555735760590 addons.xpi DEBUG Calling bootstrap method startup on langpack-en-ZA@firefox.mozilla.org version 66.0
(132 more lines...)
Collapse Failed DatabaseReportIT verifyReportExecution[7] History
49 secs
org.openqa.selenium.WebDriverException: Failed to connect to binary FirefoxBinary(/usr/bin/firefox) on port 7055; process output follows: 
-browser","l10nRegistrySources":{"toolkit":"","browser":"browser/"},"languages":["de"]},"hidden":false,"installTelemetryInfo":{"source":"app-global","method":"sideload"},"location":"app-global"}
1555735809809 addons.xpi-utils DEBUG Updating add-on states
1555735809812 addons.xpi DEBUG Calling bootstrap method startup on formautofill@mozilla.org version 1.0
1555735809813 addons.xpi DEBUG Calling bootstrap method startup on langpack-de@firefox.mozilla.org version 66.0
1555735809817 addons.xpi DEBUG Calling bootstrap method startup on langpack-en-CA@firefox.mozilla.org version 66.0
1555735809818 addons.xpi DEBUG Calling bootstrap method startup on langpack-en-GB@firefox.mozilla.org version 66.0
1555735809819 addons.xpi DEBUG Calling bootstrap method startup on langpack-en-ZA@firefox.mozilla.org version 66.0
(132 more lines...)
Collapse Failed DatabaseReportIT verifyReportExecution[8] History
49 secs
org.openqa.selenium.WebDriverException: Failed to connect to binary FirefoxBinary(/usr/bin/firefox) on port 7055; process output follows: 
-browser","l10nRegistrySources":{"toolkit":"","browser":"browser/"},"languages":["de"]},"hidden":false,"installTelemetryInfo":{"source":"app-global","method":"sideload"},"location":"app-global"}
1555735859052 addons.xpi-utils DEBUG Updating add-on states
1555735859054 addons.xpi DEBUG Calling bootstrap method startup on formautofill@mozilla.org version 1.0
1555735859056 addons.xpi DEBUG Calling bootstrap method startup on langpack-de@firefox.mozilla.org version 66.0
1555735859060 addons.xpi DEBUG Calling bootstrap method startup on langpack-en-CA@firefox.mozilla.org version 66.0
1555735859061 addons.xpi DEBUG Calling bootstrap method startup on langpack-en-GB@firefox.mozilla.org version 66.0
1555735859062 addons.xpi DEBUG Calling bootstrap method startup on langpack-en-ZA@firefox.mozilla.org version 66.0
(132 more lines...)
Collapse Failed DatabaseReportIT verifyReportExecution[9] History
49 secs
org.openqa.selenium.WebDriverException: Failed to connect to binary FirefoxBinary(/usr/bin/firefox) on port 7055; process output follows: 
e-browser","l10nRegistrySources":{"toolkit":"","browser":"browser/"},"languages":["de"]},"hidden":false,"installTelemetryInfo":{"source":"app-global","method":"sideload"},"location":"app-global"}
1555735908341 addons.xpi-utils DEBUG Updating add-on states
1555735908343 addons.xpi DEBUG Calling bootstrap method startup on formautofill@mozilla.org version 1.0
1555735908345 addons.xpi DEBUG Calling bootstrap method startup on langpack-de@firefox.mozilla.org version 66.0
1555735908349 addons.xpi DEBUG Calling bootstrap method startup on langpack-en-CA@firefox.mozilla.org version 66.0
1555735908350 addons.xpi DEBUG Calling bootstrap method startup on langpack-en-GB@firefox.mozilla.org version 66.0
1555735908351 addons.xpi DEBUG Calling bootstrap method startup on langpack-en-ZA@firefox.mozilla.org version 66.0
(132 more lines...)
Collapse Failed EditInRequisitionIT testIfNotRequisition History
52 secs
org.openqa.selenium.WebDriverException: Failed to connect to binary FirefoxBinary(/usr/bin/firefox) on port 7055; process output follows: 
-browser","l10nRegistrySources":{"toolkit":"","browser":"browser/"},"languages":["de"]},"hidden":false,"installTelemetryInfo":{"source":"app-global","method":"sideload"},"location":"app-global"}
1555728777822 addons.xpi-utils DEBUG Updating add-on states
1555728777824 addons.xpi DEBUG Calling bootstrap method startup on formautofill@mozilla.org version 1.0
1555728777826 addons.xpi DEBUG Calling bootstrap method startup on langpack-de@firefox.mozilla.org version 66.0
1555728777830 addons.xpi DEBUG Calling bootstrap method startup on langpack-en-CA@firefox.mozilla.org version 66.0
1555728777831 addons.xpi DEBUG Calling bootstrap method startup on langpack-en-GB@firefox.mozilla.org version 66.0
1555728777832 addons.xpi DEBUG Calling bootstrap method startup on langpack-en-ZA@firefox.mozilla.org version 66.0
(132 more lines...)
Collapse Failed EditInRequisitionIT testIfPending History
53 secs
org.openqa.selenium.WebDriverException: Failed to connect to binary FirefoxBinary(/usr/bin/firefox) on port 7055; process output follows: 
-browser","l10nRegistrySources":{"toolkit":"","browser":"browser/"},"languages":["de"]},"hidden":false,"installTelemetryInfo":{"source":"app-global","method":"sideload"},"location":"app-global"}
1555728724546 addons.xpi-utils DEBUG Updating add-on states
1555728724548 addons.xpi DEBUG Calling bootstrap method startup on formautofill@mozilla.org version 1.0
1555728724549 addons.xpi DEBUG Calling bootstrap method startup on langpack-de@firefox.mozilla.org version 66.0
1555728724553 addons.xpi DEBUG Calling bootstrap method startup on langpack-en-CA@firefox.mozilla.org version 66.0
1555728724554 addons.xpi DEBUG Calling bootstrap method startup on langpack-en-GB@firefox.mozilla.org version 66.0
1555728724555 addons.xpi DEBUG Calling bootstrap method startup on langpack-en-ZA@firefox.mozilla.org version 66.0
(132 more lines...)
Collapse Failed ErrorResponseIT verifyErrorResponseV1 History
49 secs
org.openqa.selenium.WebDriverException: Failed to connect to binary FirefoxBinary(/usr/bin/firefox) on port 7055; process output follows: 
e-browser","l10nRegistrySources":{"toolkit":"","browser":"browser/"},"languages":["de"]},"hidden":false,"installTelemetryInfo":{"source":"app-global","method":"sideload"},"location":"app-global"}
1555717678698 addons.xpi-utils DEBUG Updating add-on states
1555717678700 addons.xpi DEBUG Calling bootstrap method startup on formautofill@mozilla.org version 1.0
1555717678701 addons.xpi DEBUG Calling bootstrap method startup on langpack-de@firefox.mozilla.org version 66.0
1555717678705 addons.xpi DEBUG Calling bootstrap method startup on langpack-en-CA@firefox.mozilla.org version 66.0
1555717678706 addons.xpi DEBUG Calling bootstrap method startup on langpack-en-GB@firefox.mozilla.org version 66.0
1555717678707 addons.xpi DEBUG Calling bootstrap method startup on langpack-en-ZA@firefox.mozilla.org version 66.0
(132 more lines...)
Existing test failures 23
Status Test Failing since Duration
java.lang.IllegalStateException: Failed to load ApplicationContext
Caused by: java.lang.IllegalArgumentException: Cannot load an ApplicationContext with a NULL 'contextLoader'. Consider annotating your test class with @ContextConfiguration or @ContextHierarchy.
java.lang.IllegalStateException: Failed to load ApplicationContext
Caused by: java.lang.IllegalArgumentException: Cannot load an ApplicationContext with a NULL 'contextLoader'. Consider annotating your test class with @ContextConfiguration or @ContextHierarchy.
java.lang.IllegalStateException: Failed to load ApplicationContext
Caused by: java.lang.IllegalArgumentException: Cannot load an ApplicationContext with a NULL 'contextLoader'. Consider annotating your test class with @ContextConfiguration or @ContextHierarchy.
java.lang.IllegalStateException: Failed to load ApplicationContext
Caused by: java.lang.IllegalArgumentException: Cannot load an ApplicationContext with a NULL 'contextLoader'. Consider annotating your test class with @ContextConfiguration or @ContextHierarchy.
java.lang.IllegalStateException: Failed to load ApplicationContext
Caused by: java.lang.IllegalArgumentException: Cannot load an ApplicationContext with a NULL 'contextLoader'. Consider annotating your test class with @ContextConfiguration or @ContextHierarchy.
java.lang.IllegalStateException: Failed to load ApplicationContext
Caused by: java.lang.IllegalArgumentException: Cannot load an ApplicationContext with a NULL 'contextLoader'. Consider annotating your test class with @ContextConfiguration or @ContextHierarchy.
java.lang.IllegalStateException: Failed to load ApplicationContext
Caused by: java.lang.IllegalArgumentException: Cannot load an ApplicationContext with a NULL 'contextLoader'. Consider annotating your test class with @ContextConfiguration or @ContextHierarchy.
java.lang.IllegalStateException: Failed to load ApplicationContext
Caused by: java.lang.IllegalArgumentException: Cannot load an ApplicationContext with a NULL 'contextLoader'. Consider annotating your test class with @ContextConfiguration or @ContextHierarchy.
java.lang.IllegalStateException: Failed to load ApplicationContext
Caused by: java.lang.IllegalArgumentException: Cannot load an ApplicationContext with a NULL 'contextLoader'. Consider annotating your test class with @ContextConfiguration or @ContextHierarchy.
java.lang.IllegalStateException: Failed to load ApplicationContext
Caused by: java.lang.IllegalArgumentException: Cannot load an ApplicationContext with a NULL 'contextLoader'. Consider annotating your test class with @ContextConfiguration or @ContextHierarchy.
java.lang.IllegalStateException: Failed to load ApplicationContext
Caused by: java.lang.IllegalArgumentException: Cannot load an ApplicationContext with a NULL 'contextLoader'. Consider annotating your test class with @ContextConfiguration or @ContextHierarchy.
java.lang.IllegalStateException: Failed to load ApplicationContext
Caused by: java.lang.IllegalArgumentException: Cannot load an ApplicationContext with a NULL 'contextLoader'. Consider annotating your test class with @ContextConfiguration or @ContextHierarchy.
java.lang.IllegalStateException: Failed to load ApplicationContext
Caused by: java.lang.IllegalArgumentException: Cannot load an ApplicationContext with a NULL 'contextLoader'. Consider annotating your test class with @ContextConfiguration or @ContextHierarchy.
java.lang.IllegalStateException: Failed to load ApplicationContext
Caused by: java.lang.IllegalArgumentException: Cannot load an ApplicationContext with a NULL 'contextLoader'. Consider annotating your test class with @ContextConfiguration or @ContextHierarchy.
java.lang.IllegalStateException: Failed to load ApplicationContext
Caused by: java.lang.IllegalArgumentException: Cannot load an ApplicationContext with a NULL 'contextLoader'. Consider annotating your test class with @ContextConfiguration or @ContextHierarchy.
java.lang.IllegalStateException: Failed to load ApplicationContext
Caused by: java.lang.IllegalArgumentException: Cannot load an ApplicationContext with a NULL 'contextLoader'. Consider annotating your test class with @ContextConfiguration or @ContextHierarchy.
java.lang.IllegalStateException: Failed to load ApplicationContext
Caused by: java.lang.IllegalArgumentException: Cannot load an ApplicationContext with a NULL 'contextLoader'. Consider annotating your test class with @ContextConfiguration or @ContextHierarchy.
java.lang.IllegalStateException: Failed to load ApplicationContext
Caused by: java.lang.IllegalArgumentException: Cannot load an ApplicationContext with a NULL 'contextLoader'. Consider annotating your test class with @ContextConfiguration or @ContextHierarchy.
java.lang.IllegalStateException: Failed to load ApplicationContext
Caused by: java.lang.IllegalArgumentException: Cannot load an ApplicationContext with a NULL 'contextLoader'. Consider annotating your test class with @ContextConfiguration or @ContextHierarchy.
java.lang.IllegalStateException: Failed to load ApplicationContext
Caused by: java.lang.IllegalArgumentException: Cannot load an ApplicationContext with a NULL 'contextLoader'. Consider annotating your test class with @ContextConfiguration or @ContextHierarchy.
org.openqa.selenium.WebDriverException: Failed to connect to binary FirefoxBinary(/usr/bin/firefox) on port 7055; process output follows: 
-browser","l10nRegistrySources":{"toolkit":"","browser":"browser/"},"languages":["de"]},"hidden":false,"installTelemetryInfo":{"source":"app-global","method":"sideload"},"location":"app-global"}
1555728830303 addons.xpi-utils DEBUG Updating add-on states
1555728830305 addons.xpi DEBUG Calling bootstrap method startup on formautofill@mozilla.org version 1.0
1555728830306 addons.xpi DEBUG Calling bootstrap method startup on langpack-de@firefox.mozilla.org version 66.0
1555728830310 addons.xpi DEBUG Calling bootstrap method startup on langpack-en-CA@firefox.mozilla.org version 66.0
1555728830311 addons.xpi DEBUG Calling bootstrap method startup on langpack-en-GB@firefox.mozilla.org version 66.0
1555728830312 addons.xpi DEBUG Calling bootstrap method startup on langpack-en-ZA@firefox.mozilla.org version 66.0
(132 more lines...)
org.openqa.selenium.WebDriverException: Failed to connect to binary FirefoxBinary(/usr/bin/firefox) on port 7055; process output follows: 
-browser","l10nRegistrySources":{"toolkit":"","browser":"browser/"},"languages":["de"]},"hidden":false,"installTelemetryInfo":{"source":"app-global","method":"sideload"},"location":"app-global"}
1555732330020 addons.xpi-utils DEBUG Updating add-on states
1555732330022 addons.xpi DEBUG Calling bootstrap method startup on formautofill@mozilla.org version 1.0
1555732330024 addons.xpi DEBUG Calling bootstrap method startup on langpack-de@firefox.mozilla.org version 66.0
1555732330028 addons.xpi DEBUG Calling bootstrap method startup on langpack-en-CA@firefox.mozilla.org version 66.0
1555732330029 addons.xpi DEBUG Calling bootstrap method startup on langpack-en-GB@firefox.mozilla.org version 66.0
1555732330030 addons.xpi DEBUG Calling bootstrap method startup on langpack-en-ZA@firefox.mozilla.org version 66.0
(132 more lines...)
org.openqa.selenium.WebDriverException: Failed to connect to binary FirefoxBinary(/usr/bin/firefox) on port 7055; process output follows: 
e-browser","l10nRegistrySources":{"toolkit":"","browser":"browser/"},"languages":["de"]},"hidden":false,"installTelemetryInfo":{"source":"app-global","method":"sideload"},"location":"app-global"}
1555720008844 addons.xpi-utils DEBUG Updating add-on states
1555720008846 addons.xpi DEBUG Calling bootstrap method startup on formautofill@mozilla.org version 1.0
1555720008847 addons.xpi DEBUG Calling bootstrap method startup on langpack-de@firefox.mozilla.org version 66.0
1555720008851 addons.xpi DEBUG Calling bootstrap method startup on langpack-en-CA@firefox.mozilla.org version 66.0
1555720008852 addons.xpi DEBUG Calling bootstrap method startup on langpack-en-GB@firefox.mozilla.org version 66.0
1555720008853 addons.xpi DEBUG Calling bootstrap method startup on langpack-en-ZA@firefox.mozilla.org version 66.0
(132 more lines...)

Error summary

The build generated some errors. See the full build log for more details.

No Match for argument: opennms-upgrade
No Match for argument: meridian-upgrade
No Match for argument: opennms-docs
No Match for argument: meridian-docs
No Match for argument: opennms-core
No Match for argument: meridian-core
No Match for argument: opennms-plugin-ticketer-centric
No Match for argument: meridian-plugin-ticketer-centric
No Match for argument: opennms-source
No Match for argument: meridian-source
No Match for argument: opennms-remote-poller
No Match for argument: meridian-remote-poller
No Match for argument: opennms-minion-core
No Match for argument: meridian-minion-core
No Match for argument: opennms-minion-features
No Match for argument: meridian-minion-features
No Match for argument: opennms-minion-container
No Match for argument: meridian-minion-container
++ dirname /home/bamboo/ci/bamboo/xml-data/build-dir/OPENNMS-OF-SMOKEFLAP/.opennms-bamboo-utils/smoke-tests.sh
+ MYDIR=/home/bamboo/ci/bamboo/xml-data/build-dir/OPENNMS-OF-SMOKEFLAP/.opennms-bamboo-utils
++ cd /home/bamboo/ci/bamboo/xml-data/build-dir/OPENNMS-OF-SMOKEFLAP/.opennms-bamboo-utils
++ pwd
+ MYDIR=/home/bamboo/ci/bamboo/xml-data/build-dir/OPENNMS-OF-SMOKEFLAP/.opennms-bamboo-utils
+ . /home/bamboo/ci/bamboo/xml-data/build-dir/OPENNMS-OF-SMOKEFLAP/.opennms-bamboo-utils/lib.sh
++ WORKDIR=/home/bamboo/ci/bamboo/xml-data/build-dir/OPENNMS-OF-SMOKEFLAP
++ shift
++ '[' -z /home/bamboo/ci/bamboo/xml-data/build-dir/OPENNMS-OF-SMOKEFLAP ']'
++ '[' '!' -d /home/bamboo/ci/bamboo/xml-data/build-dir/OPENNMS-OF-SMOKEFLAP ']'
++ '[' -z /home/bamboo/ci/bamboo/xml-data/build-dir/OPENNMS-OF-SMOKEFLAP/.opennms-bamboo-utils ']'
++ '[' '!' -d /home/bamboo/ci/bamboo/xml-data/build-dir/OPENNMS-OF-SMOKEFLAP/.opennms-bamboo-utils ']'
++ . /home/bamboo/ci/bamboo/xml-data/build-dir/OPENNMS-OF-SMOKEFLAP/.opennms-bamboo-utils/environment.sh
+++ '[' -z OPENNMS-OF-SMOKEFLAP ']'
+++ export M2_LOCAL_REPOSITORY=/home/bamboo/.m2/repository-OPENNMS-OF-SMOKEFLAP
+++ M2_LOCAL_REPOSITORY=/home/bamboo/.m2/repository-OPENNMS-OF-SMOKEFLAP
+++ export JICMP_USE_SOCK_DGRAM=1
+++ JICMP_USE_SOCK_DGRAM=1
+++ COMPILE_OPTIONS=("-DupdatePolicy=never" "-Dmaxmemory=2g" "-Dorg.ops4j.pax.url.mvn.localRepository=$M2_LOCAL_REPOSITORY" "-Daether.connector.basic.threads=1" "-Daether.connector.resumeDownloads=false" "--batch-mode" "-Dorg.slf4j.simpleLogger.log.org.apache.maven.cli.transfer.Slf4jMavenTransferListener=warn")
+++ export COMPILE_OPTIONS
+++ SKIP_TESTS=("-Dmaven.test.skip.exec=true" "-DskipITs=true")
+++ export SKIP_TESTS
+++ ENABLE_TESTS=("-Dmaven.test.skip.exec=false" "-DskipITs=false")
+++ export ENABLE_TESTS
+++ export PATH=/usr/local/bin:/home/bamboo/ci:/home/bamboo/ci/java/java-default/bin:/usr/ccs/bin:/usr/xpg4/bin:/usr/local/node/bin:/home/bamboo/ci:/home/bamboo/ci/java/java-default/bin:/usr/ccs/bin:/usr/xpg4/bin:/usr/local/node/bin:/usr/bin:/bin:/usr/local/bin:/usr/local/bin
+++ PATH=/usr/local/bin:/home/bamboo/ci:/home/bamboo/ci/java/java-default/bin:/usr/ccs/bin:/usr/xpg4/bin:/usr/local/node/bin:/home/bamboo/ci:/home/bamboo/ci/java/java-default/bin:/usr/ccs/bin:/usr/xpg4/bin:/usr/local/node/bin:/usr/bin:/bin:/usr/local/bin:/usr/local/bin
+++ export BAMBOO_BUILD_NUMBER=139
+++ BAMBOO_BUILD_NUMBER=139
+++ export BAMBOO_WORKING_DIRECTORY=/home/bamboo/ci/bamboo/xml-data/build-dir/OPENNMS-OF-SMOKEFLAP
+++ BAMBOO_WORKING_DIRECTORY=/home/bamboo/ci/bamboo/xml-data/build-dir/OPENNMS-OF-SMOKEFLAP
+++ '[' -z '' ']'
+++ MAVEN_OPTS='-Xmx2048m -XX:ReservedCodeCacheSize=512m'
++ set -euo pipefail
+ set +eo pipefail
+ FLAPPING=false
+ getopts f OPT
+ case $OPT in
+ FLAPPING=true
+ getopts f OPT
+ '[' true = true ']'
++ git grep runFlappers
++ grep IfProfileValue
++ wc -l
+ FLAPPING_TESTS=0
+ '[' 0 -gt 0 ']'
+ echo '* Running flapping tests.'
+ export PATH=/opt/firefox:/usr/local/bin:/usr/local/bin:/home/bamboo/ci:/home/bamboo/ci/java/java-default/bin:/usr/ccs/bin:/usr/xpg4/bin:/usr/local/node/bin:/home/bamboo/ci:/home/bamboo/ci/java/java-default/bin:/usr/ccs/bin:/usr/xpg4/bin:/usr/local/node/bin:/usr/bin:/bin:/usr/local/bin:/usr/local/bin
+ PATH=/opt/firefox:/usr/local/bin:/usr/local/bin:/home/bamboo/ci:/home/bamboo/ci/java/java-default/bin:/usr/ccs/bin:/usr/xpg4/bin:/usr/local/node/bin:/home/bamboo/ci:/home/bamboo/ci/java/java-default/bin:/usr/ccs/bin:/usr/xpg4/bin:/usr/local/node/bin:/usr/bin:/bin:/usr/local/bin:/usr/local/bin
+ export PHANTOMJS_CDNURL=https://mirror.internal.opennms.com/phantomjs/
+ PHANTOMJS_CDNURL=https://mirror.internal.opennms.com/phantomjs/
+ '[' -x /home/bamboo/ci/bamboo/xml-data/build-dir/OPENNMS-OF-SMOKEFLAP/opennms-source/bin/javahome.pl ']'
++ /home/bamboo/ci/bamboo/xml-data/build-dir/OPENNMS-OF-SMOKEFLAP/opennms-source/bin/javahome.pl
+ JAVA_HOME=/usr/lib/jvm/java-8-oracle
+ export JAVA_HOME
++ find rpms -name 'opennms-core-*.rpm' -o -name 'meridian-core-*.rpm'
+ CORE_RPM=rpms/opennms-core-25.0.0-0.20190419.of.develop.139.noarch.rpm
++ echo rpms/opennms-core-25.0.0-0.20190419.of.develop.139.noarch.rpm
++ wc -w
+ '[' 1 -ne 1 ']'
++ rpm -q '--queryformat=%{version}-%{release}\n' -p rpms/opennms-core-25.0.0-0.20190419.of.develop.139.noarch.rpm
+ RPM_VERSION=25.0.0-0.20190419.of.develop.139
+ echo 'RPM Version: 25.0.0-0.20190419.of.develop.139'
+ ls -1 /home/bamboo/ci/bamboo/xml-data/build-dir/OPENNMS-OF-SMOKEFLAP/rpms/opennms-25.0.0-0.20190419.of.develop.139.noarch.rpm /home/bamboo/ci/bamboo/xml-data/build-dir/OPENNMS-OF-SMOKEFLAP/rpms/opennms-core-25.0.0-0.20190419.of.develop.139.noarch.rpm /home/bamboo/ci/bamboo/xml-data/build-dir/OPENNMS-OF-SMOKEFLAP/rpms/opennms-docs-25.0.0-0.20190419.of.develop.139.noarch.rpm /home/bamboo/ci/bamboo/xml-data/build-dir/OPENNMS-OF-SMOKEFLAP/rpms/opennms-jmx-config-generator-25.0.0-0.20190419.of.develop.139.noarch.rpm /home/bamboo/ci/bamboo/xml-data/build-dir/OPENNMS-OF-SMOKEFLAP/rpms/opennms-minion-25.0.0-0.20190419.of.develop.139.noarch.rpm /home/bamboo/ci/bamboo/xml-data/build-dir/OPENNMS-OF-SMOKEFLAP/rpms/opennms-minion-container-25.0.0-0.20190419.of.develop.139.noarch.rpm /home/bamboo/ci/bamboo/xml-data/build-dir/OPENNMS-OF-SMOKEFLAP/rpms/opennms-minion-features-core-25.0.0-0.20190419.of.develop.139.noarch.rpm /home/bamboo/ci/bamboo/xml-data/build-dir/OPENNMS-OF-SMOKEFLAP/rpms/opennms-minion-features-default-25.0.0-0.20190419.of.develop.139.noarch.rpm /home/bamboo/ci/bamboo/xml-data/build-dir/OPENNMS-OF-SMOKEFLAP/rpms/opennms-plugin-collector-juniper-tca-25.0.0-0.20190419.of.develop.139.noarch.rpm /home/bamboo/ci/bamboo/xml-data/build-dir/OPENNMS-OF-SMOKEFLAP/rpms/opennms-plugin-collector-vtdxml-handler-25.0.0-0.20190419.of.develop.139.noarch.rpm /home/bamboo/ci/bamboo/xml-data/build-dir/OPENNMS-OF-SMOKEFLAP/rpms/opennms-plugin-northbounder-jms-25.0.0-0.20190419.of.develop.139.noarch.rpm /home/bamboo/ci/bamboo/xml-data/build-dir/OPENNMS-OF-SMOKEFLAP/rpms/opennms-plugin-protocol-cifs-25.0.0-0.20190419.of.develop.139.noarch.rpm /home/bamboo/ci/bamboo/xml-data/build-dir/OPENNMS-OF-SMOKEFLAP/rpms/opennms-plugin-protocol-nsclient-25.0.0-0.20190419.of.develop.139.noarch.rpm /home/bamboo/ci/bamboo/xml-data/build-dir/OPENNMS-OF-SMOKEFLAP/rpms/opennms-plugin-protocol-radius-25.0.0-0.20190419.of.develop.139.noarch.rpm /home/bamboo/ci/bamboo/xml-data/build-dir/OPENNMS-OF-SMOKEFLAP/rpms/opennms-plugin-protocol-xmp-25.0.0-0.20190419.of.develop.139.noarch.rpm /home/bamboo/ci/bamboo/xml-data/build-dir/OPENNMS-OF-SMOKEFLAP/rpms/opennms-plugin-provisioning-dns-25.0.0-0.20190419.of.develop.139.noarch.rpm /home/bamboo/ci/bamboo/xml-data/build-dir/OPENNMS-OF-SMOKEFLAP/rpms/opennms-plugin-provisioning-rancid-25.0.0-0.20190419.of.develop.139.noarch.rpm /home/bamboo/ci/bamboo/xml-data/build-dir/OPENNMS-OF-SMOKEFLAP/rpms/opennms-plugin-provisioning-reverse-dns-25.0.0-0.20190419.of.develop.139.noarch.rpm /home/bamboo/ci/bamboo/xml-data/build-dir/OPENNMS-OF-SMOKEFLAP/rpms/opennms-plugin-provisioning-snmp-asset-25.0.0-0.20190419.of.develop.139.noarch.rpm /home/bamboo/ci/bamboo/xml-data/build-dir/OPENNMS-OF-SMOKEFLAP/rpms/opennms-plugin-provisioning-snmp-hardware-inventory-25.0.0-0.20190419.of.develop.139.noarch.rpm /home/bamboo/ci/bamboo/xml-data/build-dir/OPENNMS-OF-SMOKEFLAP/rpms/opennms-plugin-provisioning-wsman-asset-25.0.0-0.20190419.of.develop.139.noarch.rpm /home/bamboo/ci/bamboo/xml-data/build-dir/OPENNMS-OF-SMOKEFLAP/rpms/opennms-plugins-25.0.0-0.20190419.of.develop.139.noarch.rpm /home/bamboo/ci/bamboo/xml-data/build-dir/OPENNMS-OF-SMOKEFLAP/rpms/opennms-plugin-ticketer-jira-25.0.0-0.20190419.of.develop.139.noarch.rpm /home/bamboo/ci/bamboo/xml-data/build-dir/OPENNMS-OF-SMOKEFLAP/rpms/opennms-plugin-ticketer-otrs-25.0.0-0.20190419.of.develop.139.noarch.rpm /home/bamboo/ci/bamboo/xml-data/build-dir/OPENNMS-OF-SMOKEFLAP/rpms/opennms-plugin-ticketer-rt-25.0.0-0.20190419.of.develop.139.noarch.rpm /home/bamboo/ci/bamboo/xml-data/build-dir/OPENNMS-OF-SMOKEFLAP/rpms/opennms-remote-poller-25.0.0-0.20190419.of.develop.139.noarch.rpm /home/bamboo/ci/bamboo/xml-data/build-dir/OPENNMS-OF-SMOKEFLAP/rpms/opennms-sentinel-25.0.0-0.20190419.of.develop.139.noarch.rpm /home/bamboo/ci/bamboo/xml-data/build-dir/OPENNMS-OF-SMOKEFLAP/rpms/opennms-source-25.0.0-0.20190419.of.develop.139.noarch.rpm /home/bamboo/ci/bamboo/xml-data/build-dir/OPENNMS-OF-SMOKEFLAP/rpms/opennms-webapp-hawtio-25.0.0-0.20190419.of.develop.139.noarch.rpm /home/bamboo/ci/bamboo/xml-data/build-dir/OPENNMS-OF-SMOKEFLAP/rpms/opennms-webapp-jetty-25.0.0-0.20190419.of.develop.139.noarch.rpm /home/bamboo/ci/bamboo/xml-data/build-dir/OPENNMS-OF-SMOKEFLAP/rpms/opennms-webapp-remoting-25.0.0-0.20190419.of.develop.139.noarch.rpm
++ grep -C1 org.opennms.smoke.test-api /home/bamboo/ci/bamboo/xml-data/build-dir/OPENNMS-OF-SMOKEFLAP/opennms-source/smoke-test/pom.xml
++ grep '<version>'
++ sed -e 's,.*<version>,,' -e 's,</version>,,' -e 's,-SNAPSHOT$,,'
+ SMOKE_TEST_API_VERSION=2
+ case "$SMOKE_TEST_API_VERSION" in
+ DOCKERDIR=/home/bamboo/ci/bamboo/xml-data/build-dir/OPENNMS-OF-SMOKEFLAP/opennms-system-test-api/docker
+ echo '* Found Dockerized smoke tests'
+ case "$SMOKE_TEST_API_VERSION" in
+ mkdir -p /home/bamboo/ci/bamboo/xml-data/build-dir/OPENNMS-OF-SMOKEFLAP/opennms-system-test-api/docker/opennms/rpms /home/bamboo/ci/bamboo/xml-data/build-dir/OPENNMS-OF-SMOKEFLAP/opennms-system-test-api/docker/minion/rpms /home/bamboo/ci/bamboo/xml-data/build-dir/OPENNMS-OF-SMOKEFLAP/opennms-system-test-api/docker/sentinel/rpms
+ rm -rf '/home/bamboo/ci/bamboo/xml-data/build-dir/OPENNMS-OF-SMOKEFLAP/opennms-system-test-api/docker/opennms/rpms/*.rpm' '/home/bamboo/ci/bamboo/xml-data/build-dir/OPENNMS-OF-SMOKEFLAP/opennms-system-test-api/docker/minion/rpms/*.rpm' '/home/bamboo/ci/bamboo/xml-data/build-dir/OPENNMS-OF-SMOKEFLAP/opennms-system-test-api/docker/sentinel/rpms/*.rpm'
+ mv /home/bamboo/ci/bamboo/xml-data/build-dir/OPENNMS-OF-SMOKEFLAP/rpms/opennms-25.0.0-0.20190419.of.develop.139.noarch.rpm /home/bamboo/ci/bamboo/xml-data/build-dir/OPENNMS-OF-SMOKEFLAP/rpms/opennms-core-25.0.0-0.20190419.of.develop.139.noarch.rpm /home/bamboo/ci/bamboo/xml-data/build-dir/OPENNMS-OF-SMOKEFLAP/rpms/opennms-docs-25.0.0-0.20190419.of.develop.139.noarch.rpm /home/bamboo/ci/bamboo/xml-data/build-dir/OPENNMS-OF-SMOKEFLAP/rpms/opennms-jmx-config-generator-25.0.0-0.20190419.of.develop.139.noarch.rpm /home/bamboo/ci/bamboo/xml-data/build-dir/OPENNMS-OF-SMOKEFLAP/rpms/opennms-minion-25.0.0-0.20190419.of.develop.139.noarch.rpm /home/bamboo/ci/bamboo/xml-data/build-dir/OPENNMS-OF-SMOKEFLAP/rpms/opennms-minion-container-25.0.0-0.20190419.of.develop.139.noarch.rpm /home/bamboo/ci/bamboo/xml-data/build-dir/OPENNMS-OF-SMOKEFLAP/rpms/opennms-minion-features-core-25.0.0-0.20190419.of.develop.139.noarch.rpm /home/bamboo/ci/bamboo/xml-data/build-dir/OPENNMS-OF-SMOKEFLAP/rpms/opennms-minion-features-default-25.0.0-0.20190419.of.develop.139.noarch.rpm /home/bamboo/ci/bamboo/xml-data/build-dir/OPENNMS-OF-SMOKEFLAP/rpms/opennms-plugin-collector-juniper-tca-25.0.0-0.20190419.of.develop.139.noarch.rpm /home/bamboo/ci/bamboo/xml-data/build-dir/OPENNMS-OF-SMOKEFLAP/rpms/opennms-plugin-collector-vtdxml-handler-25.0.0-0.20190419.of.develop.139.noarch.rpm /home/bamboo/ci/bamboo/xml-data/build-dir/OPENNMS-OF-SMOKEFLAP/rpms/opennms-plugin-northbounder-jms-25.0.0-0.20190419.of.develop.139.noarch.rpm /home/bamboo/ci/bamboo/xml-data/build-dir/OPENNMS-OF-SMOKEFLAP/rpms/opennms-plugin-protocol-cifs-25.0.0-0.20190419.of.develop.139.noarch.rpm /home/bamboo/ci/bamboo/xml-data/build-dir/OPENNMS-OF-SMOKEFLAP/rpms/opennms-plugin-protocol-nsclient-25.0.0-0.20190419.of.develop.139.noarch.rpm /home/bamboo/ci/bamboo/xml-data/build-dir/OPENNMS-OF-SMOKEFLAP/rpms/opennms-plugin-protocol-radius-25.0.0-0.20190419.of.develop.139.noarch.rpm /home/bamboo/ci/bamboo/xml-data/build-dir/OPENNMS-OF-SMOKEFLAP/rpms/opennms-plugin-protocol-xmp-25.0.0-0.20190419.of.develop.139.noarch.rpm /home/bamboo/ci/bamboo/xml-data/build-dir/OPENNMS-OF-SMOKEFLAP/rpms/opennms-plugin-provisioning-dns-25.0.0-0.20190419.of.develop.139.noarch.rpm /home/bamboo/ci/bamboo/xml-data/build-dir/OPENNMS-OF-SMOKEFLAP/rpms/opennms-plugin-provisioning-rancid-25.0.0-0.20190419.of.develop.139.noarch.rpm /home/bamboo/ci/bamboo/xml-data/build-dir/OPENNMS-OF-SMOKEFLAP/rpms/opennms-plugin-provisioning-reverse-dns-25.0.0-0.20190419.of.develop.139.noarch.rpm /home/bamboo/ci/bamboo/xml-data/build-dir/OPENNMS-OF-SMOKEFLAP/rpms/opennms-plugin-provisioning-snmp-asset-25.0.0-0.20190419.of.develop.139.noarch.rpm /home/bamboo/ci/bamboo/xml-data/build-dir/OPENNMS-OF-SMOKEFLAP/rpms/opennms-plugin-provisioning-snmp-hardware-inventory-25.0.0-0.20190419.of.develop.139.noarch.rpm /home/bamboo/ci/bamboo/xml-data/build-dir/OPENNMS-OF-SMOKEFLAP/rpms/opennms-plugin-provisioning-wsman-asset-25.0.0-0.20190419.of.develop.139.noarch.rpm /home/bamboo/ci/bamboo/xml-data/build-dir/OPENNMS-OF-SMOKEFLAP/rpms/opennms-plugins-25.0.0-0.20190419.of.develop.139.noarch.rpm /home/bamboo/ci/bamboo/xml-data/build-dir/OPENNMS-OF-SMOKEFLAP/rpms/opennms-plugin-ticketer-jira-25.0.0-0.20190419.of.develop.139.noarch.rpm /home/bamboo/ci/bamboo/xml-data/build-dir/OPENNMS-OF-SMOKEFLAP/rpms/opennms-plugin-ticketer-otrs-25.0.0-0.20190419.of.develop.139.noarch.rpm /home/bamboo/ci/bamboo/xml-data/build-dir/OPENNMS-OF-SMOKEFLAP/rpms/opennms-plugin-ticketer-rt-25.0.0-0.20190419.of.develop.139.noarch.rpm /home/bamboo/ci/bamboo/xml-data/build-dir/OPENNMS-OF-SMOKEFLAP/rpms/opennms-remote-poller-25.0.0-0.20190419.of.develop.139.noarch.rpm /home/bamboo/ci/bamboo/xml-data/build-dir/OPENNMS-OF-SMOKEFLAP/rpms/opennms-sentinel-25.0.0-0.20190419.of.develop.139.noarch.rpm /home/bamboo/ci/bamboo/xml-data/build-dir/OPENNMS-OF-SMOKEFLAP/rpms/opennms-source-25.0.0-0.20190419.of.develop.139.noarch.rpm /home/bamboo/ci/bamboo/xml-data/build-dir/OPENNMS-OF-SMOKEFLAP/rpms/opennms-webapp-hawtio-25.0.0-0.20190419.of.develop.139.noarch.rpm /home/bamboo/ci/bamboo/xml-data/build-dir/OPENNMS-OF-SMOKEFLAP/rpms/opennms-webapp-jetty-25.0.0-0.20190419.of.develop.139.noarch.rpm /home/bamboo/ci/bamboo/xml-data/build-dir/OPENNMS-OF-SMOKEFLAP/rpms/opennms-webapp-remoting-25.0.0-0.20190419.of.develop.139.noarch.rpm /home/bamboo/ci/bamboo/xml-data/build-dir/OPENNMS-OF-SMOKEFLAP/opennms-system-test-api/docker/opennms/rpms/
+ mv /home/bamboo/ci/bamboo/xml-data/build-dir/OPENNMS-OF-SMOKEFLAP/opennms-system-test-api/docker/opennms/rpms/opennms-minion-25.0.0-0.20190419.of.develop.139.noarch.rpm /home/bamboo/ci/bamboo/xml-data/build-dir/OPENNMS-OF-SMOKEFLAP/opennms-system-test-api/docker/opennms/rpms/opennms-minion-container-25.0.0-0.20190419.of.develop.139.noarch.rpm /home/bamboo/ci/bamboo/xml-data/build-dir/OPENNMS-OF-SMOKEFLAP/opennms-system-test-api/docker/opennms/rpms/opennms-minion-features-core-25.0.0-0.20190419.of.develop.139.noarch.rpm /home/bamboo/ci/bamboo/xml-data/build-dir/OPENNMS-OF-SMOKEFLAP/opennms-system-test-api/docker/opennms/rpms/opennms-minion-features-default-25.0.0-0.20190419.of.develop.139.noarch.rpm /home/bamboo/ci/bamboo/xml-data/build-dir/OPENNMS-OF-SMOKEFLAP/opennms-system-test-api/docker/minion/rpms/
+ mv /home/bamboo/ci/bamboo/xml-data/build-dir/OPENNMS-OF-SMOKEFLAP/opennms-system-test-api/docker/opennms/rpms/opennms-sentinel-25.0.0-0.20190419.of.develop.139.noarch.rpm /home/bamboo/ci/bamboo/xml-data/build-dir/OPENNMS-OF-SMOKEFLAP/opennms-system-test-api/docker/sentinel/rpms/
+ cd /home/bamboo/ci/bamboo/xml-data/build-dir/OPENNMS-OF-SMOKEFLAP/opennms-system-test-api/docker
+ ./build-docker-images.sh
+ cd /home/bamboo/ci/bamboo/xml-data/build-dir/OPENNMS-OF-SMOKEFLAP
+ EXTRA_ARGS=()
+ set +u
+ '[' -n 172.20.1.201 ']'
+ EXTRA_ARGS+=("-Dorg.opennms.advertised-host-address=${bamboo_capability_host_address}")
+ set -u
+ RERUNS=2
+ '[' true = true ']'
+ RERUNS=0
+ EXTRA_ARGS+=('-DrunFlappers=true')
+ cd /home/bamboo/ci/bamboo/xml-data/build-dir/OPENNMS-OF-SMOKEFLAP/opennms-source
+ ./compile.pl -Dmaven.test.skip.exec=true -Dsmoke=true --projects org.opennms:smoke-test --also-make install
+ cd smoke-test
+ xvfb-run --wait=20 '--server-args=-screen 0 1920x1080x24' --server-num=80 --auto-servernum --listen-tcp ../compile.pl -Dsurefire.rerunFailingTestsCount=0 -Dfailsafe.rerunFailingTestsCount=0 -Dorg.opennms.smoketest.logLevel=INFO -Dtest.fork.count=1 -Dorg.opennms.smoketest.docker=true -Dorg.opennms.advertised-host-address=172.20.1.201 -DrunFlappers=true -Dsmoke=true -t
+ exit 1
No Match for argument: opennms-upgrade
No Match for argument: meridian-upgrade
No Match for argument: opennms-docs
No Match for argument: meridian-docs
No Match for argument: opennms-core
No Match for argument: meridian-core
No Match for argument: opennms-plugin-ticketer-centric
No Match for argument: meridian-plugin-ticketer-centric
No Match for argument: opennms-source
No Match for argument: meridian-source
No Match for argument: opennms-remote-poller
No Match for argument: meridian-remote-poller
No Match for argument: opennms-minion-core
No Match for argument: meridian-minion-core
No Match for argument: opennms-minion-features
No Match for argument: meridian-minion-features
No Match for argument: opennms-minion-container
No Match for argument: meridian-minion-container