Build #116

Build: #116 failed

Job: Smoke Test (Flapping) failed

Job result summary

Completed
Duration
344 minutes
Agent
hogwarts.internal.opennms.com
Revisions
OpenNMS (develop branch)
1c1c582255fe576f432531998f126ac3ba98de05 1c1c582255fe576f432531998f126ac3ba98de05
Smoke Tests
cb1e72265cf2ce10cb4872f58120272b340a1ce1 cb1e72265cf2ce10cb4872f58120272b340a1ce1
OpenNMS Bamboo Utils
0a62053bc90f6ffcce1e17256674b2dae7b4f8a3 0a62053bc90f6ffcce1e17256674b2dae7b4f8a3
OpenNMS System Test API
2f3a985377db43ce9b451390b9744bac402ffbd7 2f3a985377db43ce9b451390b9744bac402ffbd7
Total tests
222
Failing since
#30 (Code changes detected – )

Tests

  • 222 tests in total
  • 104 tests failed
  • 81 failures are new
  • 1 test was fixed
  • 4 tests were quarantined / skipped
  • 219 minutes taken in total.
New test failures 81
Status Test Duration
Collapse Failed AdminPageIT testAllLinks History
15 secs
java.lang.AssertionError: We expect 31 link entries on the admin page. expected:<31> but was:<24>
	at org.opennms.smoketest.AdminPageIT.testAllLinks(AdminPageIT.java:118)
Collapse Failed AdminPageIT testAllTextIsPresent History
12 secs
java.lang.AssertionError: expected:<10> but was:<9>
	at org.opennms.smoketest.AdminPageIT.testAllTextIsPresent(AdminPageIT.java:100)
Collapse Failed AlarmElasticsearch5IT canForwardAlarmToEs History
2 mins
com.jayway.awaitility.core.ConditionTimeoutException: Lambda expression in org.opennms.smoketest.AlarmElasticsearch5IT that uses java.net.InetSocketAddress: expected <1L> but was <0> within 2 minutes.
	at org.opennms.smoketest.AlarmElasticsearch5IT.canForwardAlarmToEs(AlarmElasticsearch5IT.java:111)
Collapse Failed ClassificationRulePageIT verifyClassification History
18 secs
org.openqa.selenium.TimeoutException: Timed out after 5 seconds waiting for org.opennms.smoketest.ClassificationRulePageIT$Page$$Lambda$121/108005819@562b28ce
Build info: version: '2.53.1', revision: 'a36b8b1cd5757287168e54b817830adce9b0158d', time: '2016-06-30 19:26:09'
System info: host: 'bambooagent01.internal.opennms.com', ip: '172.20.1.213', os.name: 'Linux', os.arch: 'amd64', os.version: '4.15.0-46-generic', java.version: '1.8.0_201'
Driver info: org.openqa.selenium.firefox.FirefoxDriver
Capabilities [{applicationCacheEnabled=true, rotatable=false, handlesAlerts=true, databaseEnabled=true, version=45.0.2, platform=LINUX, nativeEvents=false, acceptSslCerts=true, webStorageEnabled=true, locationContextEnabled=true, browserName=firefox, takesScreenshot=true, javascriptEnabled=true, cssSelectorsEnabled=true}]
Session ID: f7dce715-6c24-4e13-aecf-ac4a1009ea82
org.openqa.selenium.TimeoutException: 
Timed out after 5 seconds waiting for org.opennms.smoketest.ClassificationRulePageIT$Page$$Lambda$121/108005819@562b28ce
(6 more lines...)
Collapse Failed ClassificationRulePageIT verifyErrorMessageReset History
18 secs
org.openqa.selenium.TimeoutException: Timed out after 5 seconds waiting for org.opennms.smoketest.ClassificationRulePageIT$Page$$Lambda$121/108005819@3661ebcf
Build info: version: '2.53.1', revision: 'a36b8b1cd5757287168e54b817830adce9b0158d', time: '2016-06-30 19:26:09'
System info: host: 'bambooagent01.internal.opennms.com', ip: '172.20.1.213', os.name: 'Linux', os.arch: 'amd64', os.version: '4.15.0-46-generic', java.version: '1.8.0_201'
Driver info: org.openqa.selenium.firefox.FirefoxDriver
Capabilities [{applicationCacheEnabled=true, rotatable=false, handlesAlerts=true, databaseEnabled=true, version=45.0.2, platform=LINUX, nativeEvents=false, acceptSslCerts=true, webStorageEnabled=true, locationContextEnabled=true, browserName=firefox, takesScreenshot=true, javascriptEnabled=true, cssSelectorsEnabled=true}]
Session ID: 6d55cd0a-cb27-40e0-8bd1-fecf80e1e528
org.openqa.selenium.TimeoutException: 
Timed out after 5 seconds waiting for org.opennms.smoketest.ClassificationRulePageIT$Page$$Lambda$121/108005819@3661ebcf
(6 more lines...)
Collapse Failed ClassificationRulePageIT verifyExporterFilter History
18 secs
org.openqa.selenium.TimeoutException: Timed out after 5 seconds waiting for org.opennms.smoketest.ClassificationRulePageIT$Page$$Lambda$121/108005819@40712d3
Build info: version: '2.53.1', revision: 'a36b8b1cd5757287168e54b817830adce9b0158d', time: '2016-06-30 19:26:09'
System info: host: 'bambooagent01.internal.opennms.com', ip: '172.20.1.213', os.name: 'Linux', os.arch: 'amd64', os.version: '4.15.0-46-generic', java.version: '1.8.0_201'
Driver info: org.openqa.selenium.firefox.FirefoxDriver
Capabilities [{applicationCacheEnabled=true, rotatable=false, handlesAlerts=true, databaseEnabled=true, version=45.0.2, platform=LINUX, nativeEvents=false, acceptSslCerts=true, webStorageEnabled=true, locationContextEnabled=true, browserName=firefox, takesScreenshot=true, javascriptEnabled=true, cssSelectorsEnabled=true}]
Session ID: 58ebd279-658c-4dbd-9446-8562db3f514f
org.openqa.selenium.TimeoutException: 
Timed out after 5 seconds waiting for org.opennms.smoketest.ClassificationRulePageIT$Page$$Lambda$121/108005819@40712d3
(6 more lines...)
Collapse Failed ClassificationRulePageIT verifyReadOnlyGroup History
18 secs
org.openqa.selenium.TimeoutException: Timed out after 5 seconds waiting for org.opennms.smoketest.ClassificationRulePageIT$Page$$Lambda$121/108005819@3dabb3c8
Build info: version: '2.53.1', revision: 'a36b8b1cd5757287168e54b817830adce9b0158d', time: '2016-06-30 19:26:09'
System info: host: 'bambooagent01.internal.opennms.com', ip: '172.20.1.213', os.name: 'Linux', os.arch: 'amd64', os.version: '4.15.0-46-generic', java.version: '1.8.0_201'
Driver info: org.openqa.selenium.firefox.FirefoxDriver
Capabilities [{applicationCacheEnabled=true, rotatable=false, handlesAlerts=true, databaseEnabled=true, version=45.0.2, platform=LINUX, nativeEvents=false, acceptSslCerts=true, webStorageEnabled=true, locationContextEnabled=true, browserName=firefox, takesScreenshot=true, javascriptEnabled=true, cssSelectorsEnabled=true}]
Session ID: 789dbace-1536-4b46-801a-f790812036d3
org.openqa.selenium.TimeoutException: 
Timed out after 5 seconds waiting for org.opennms.smoketest.ClassificationRulePageIT$Page$$Lambda$121/108005819@3dabb3c8
(6 more lines...)
Collapse Failed ClassificationRulePageIT verifyRuleCRUD History
18 secs
org.openqa.selenium.TimeoutException: Timed out after 5 seconds waiting for org.opennms.smoketest.ClassificationRulePageIT$Page$$Lambda$121/108005819@1e690156
Build info: version: '2.53.1', revision: 'a36b8b1cd5757287168e54b817830adce9b0158d', time: '2016-06-30 19:26:09'
System info: host: 'bambooagent01.internal.opennms.com', ip: '172.20.1.213', os.name: 'Linux', os.arch: 'amd64', os.version: '4.15.0-46-generic', java.version: '1.8.0_201'
Driver info: org.openqa.selenium.firefox.FirefoxDriver
Capabilities [{applicationCacheEnabled=true, rotatable=false, handlesAlerts=true, databaseEnabled=true, version=45.0.2, platform=LINUX, nativeEvents=false, acceptSslCerts=true, webStorageEnabled=true, locationContextEnabled=true, browserName=firefox, takesScreenshot=true, javascriptEnabled=true, cssSelectorsEnabled=true}]
Session ID: 852a6743-bda1-4273-8875-e9369af5e098
org.openqa.selenium.TimeoutException: 
Timed out after 5 seconds waiting for org.opennms.smoketest.ClassificationRulePageIT$Page$$Lambda$121/108005819@1e690156
(6 more lines...)
Collapse Failed ClassificationRulePageIT verifyRulePaginationAndDeleteAll History
20 secs
org.openqa.selenium.TimeoutException: Timed out after 5 seconds waiting for org.opennms.smoketest.ClassificationRulePageIT$Page$$Lambda$121/108005819@407cdbb2
Build info: version: '2.53.1', revision: 'a36b8b1cd5757287168e54b817830adce9b0158d', time: '2016-06-30 19:26:09'
System info: host: 'bambooagent01.internal.opennms.com', ip: '172.20.1.213', os.name: 'Linux', os.arch: 'amd64', os.version: '4.15.0-46-generic', java.version: '1.8.0_201'
Driver info: org.openqa.selenium.firefox.FirefoxDriver
Capabilities [{applicationCacheEnabled=true, rotatable=false, handlesAlerts=true, databaseEnabled=true, version=45.0.2, platform=LINUX, nativeEvents=false, acceptSslCerts=true, webStorageEnabled=true, locationContextEnabled=true, browserName=firefox, takesScreenshot=true, javascriptEnabled=true, cssSelectorsEnabled=true}]
Session ID: 0e48da3f-d8be-49e9-8d77-31c7b0ddc676
org.openqa.selenium.TimeoutException: 
Timed out after 5 seconds waiting for org.opennms.smoketest.ClassificationRulePageIT$Page$$Lambda$121/108005819@407cdbb2
(6 more lines...)
Collapse Failed ClassificationRulePageIT verifySearch History
18 secs
org.openqa.selenium.TimeoutException: Timed out after 5 seconds waiting for org.opennms.smoketest.ClassificationRulePageIT$Page$$Lambda$121/108005819@21eee291
Build info: version: '2.53.1', revision: 'a36b8b1cd5757287168e54b817830adce9b0158d', time: '2016-06-30 19:26:09'
System info: host: 'bambooagent01.internal.opennms.com', ip: '172.20.1.213', os.name: 'Linux', os.arch: 'amd64', os.version: '4.15.0-46-generic', java.version: '1.8.0_201'
Driver info: org.openqa.selenium.firefox.FirefoxDriver
Capabilities [{applicationCacheEnabled=true, rotatable=false, handlesAlerts=true, databaseEnabled=true, version=45.0.2, platform=LINUX, nativeEvents=false, acceptSslCerts=true, webStorageEnabled=true, locationContextEnabled=true, browserName=firefox, takesScreenshot=true, javascriptEnabled=true, cssSelectorsEnabled=true}]
Session ID: e2c2bc94-ff48-4d17-83cd-28b3ac05a304
org.openqa.selenium.TimeoutException: 
Timed out after 5 seconds waiting for org.opennms.smoketest.ClassificationRulePageIT$Page$$Lambda$121/108005819@21eee291
(6 more lines...)
Collapse Failed ClassificationRulePageIT verifySettingsTab History
18 secs
org.openqa.selenium.TimeoutException: Timed out after 5 seconds waiting for org.opennms.smoketest.ClassificationRulePageIT$Page$$Lambda$121/108005819@4ebac569
Build info: version: '2.53.1', revision: 'a36b8b1cd5757287168e54b817830adce9b0158d', time: '2016-06-30 19:26:09'
System info: host: 'bambooagent01.internal.opennms.com', ip: '172.20.1.213', os.name: 'Linux', os.arch: 'amd64', os.version: '4.15.0-46-generic', java.version: '1.8.0_201'
Driver info: org.openqa.selenium.firefox.FirefoxDriver
Capabilities [{applicationCacheEnabled=true, rotatable=false, handlesAlerts=true, databaseEnabled=true, version=45.0.2, platform=LINUX, nativeEvents=false, acceptSslCerts=true, webStorageEnabled=true, locationContextEnabled=true, browserName=firefox, takesScreenshot=true, javascriptEnabled=true, cssSelectorsEnabled=true}]
Session ID: 2175b34f-6238-4a59-8ac0-401d741a928f
org.openqa.selenium.TimeoutException: 
Timed out after 5 seconds waiting for org.opennms.smoketest.ClassificationRulePageIT$Page$$Lambda$121/108005819@4ebac569
(6 more lines...)
Collapse Failed ClassificationRulePageIT verifySrcValues History
18 secs
org.openqa.selenium.TimeoutException: Timed out after 5 seconds waiting for org.opennms.smoketest.ClassificationRulePageIT$Page$$Lambda$121/108005819@5eee0539
Build info: version: '2.53.1', revision: 'a36b8b1cd5757287168e54b817830adce9b0158d', time: '2016-06-30 19:26:09'
System info: host: 'bambooagent01.internal.opennms.com', ip: '172.20.1.213', os.name: 'Linux', os.arch: 'amd64', os.version: '4.15.0-46-generic', java.version: '1.8.0_201'
Driver info: org.openqa.selenium.firefox.FirefoxDriver
Capabilities [{applicationCacheEnabled=true, rotatable=false, handlesAlerts=true, databaseEnabled=true, version=45.0.2, platform=LINUX, nativeEvents=false, acceptSslCerts=true, webStorageEnabled=true, locationContextEnabled=true, browserName=firefox, takesScreenshot=true, javascriptEnabled=true, cssSelectorsEnabled=true}]
Session ID: a79cb7ef-c7af-4228-8b66-757357f4fd06
org.openqa.selenium.TimeoutException: 
Timed out after 5 seconds waiting for org.opennms.smoketest.ClassificationRulePageIT$Page$$Lambda$121/108005819@5eee0539
(6 more lines...)
Collapse Failed ClassificationRulePageIT verifyTabs History
18 secs
org.openqa.selenium.TimeoutException: Timed out after 5 seconds waiting for org.opennms.smoketest.ClassificationRulePageIT$Page$$Lambda$121/108005819@4f122c6b
Build info: version: '2.53.1', revision: 'a36b8b1cd5757287168e54b817830adce9b0158d', time: '2016-06-30 19:26:09'
System info: host: 'bambooagent01.internal.opennms.com', ip: '172.20.1.213', os.name: 'Linux', os.arch: 'amd64', os.version: '4.15.0-46-generic', java.version: '1.8.0_201'
Driver info: org.openqa.selenium.firefox.FirefoxDriver
Capabilities [{applicationCacheEnabled=true, rotatable=false, handlesAlerts=true, databaseEnabled=true, version=45.0.2, platform=LINUX, nativeEvents=false, acceptSslCerts=true, webStorageEnabled=true, locationContextEnabled=true, browserName=firefox, takesScreenshot=true, javascriptEnabled=true, cssSelectorsEnabled=true}]
Session ID: c984a388-ed2f-4300-b723-fa9976d2cd2e
org.openqa.selenium.TimeoutException: 
Timed out after 5 seconds waiting for org.opennms.smoketest.ClassificationRulePageIT$Page$$Lambda$121/108005819@4f122c6b
(6 more lines...)
Collapse Failed IndexPageIT verifyStatusMap History
2 mins
org.openqa.selenium.TimeoutException: Timed out after 120 seconds waiting for org.opennms.smoketest.IndexPageIT$1@220700c1
Build info: version: '2.53.1', revision: 'a36b8b1cd5757287168e54b817830adce9b0158d', time: '2016-06-30 19:26:09'
System info: host: 'bambooagent01.internal.opennms.com', ip: '172.20.1.213', os.name: 'Linux', os.arch: 'amd64', os.version: '4.15.0-46-generic', java.version: '1.8.0_201'
Driver info: org.openqa.selenium.firefox.FirefoxDriver
Capabilities [{applicationCacheEnabled=true, rotatable=false, handlesAlerts=true, databaseEnabled=true, version=45.0.2, platform=LINUX, nativeEvents=false, acceptSslCerts=true, webStorageEnabled=true, locationContextEnabled=true, browserName=firefox, takesScreenshot=true, javascriptEnabled=true, cssSelectorsEnabled=true}]
Session ID: 234f6db2-eacc-49c1-83b9-13d87cc0287f
org.openqa.selenium.TimeoutException: 
Timed out after 120 seconds waiting for org.opennms.smoketest.IndexPageIT$1@220700c1
(6 more lines...)
Collapse Failed IntegrationAPIIT canLoadSampleProject History
2 mins
com.jayway.awaitility.core.ConditionTimeoutException: Condition with lambda expression in org.opennms.smoketest.IntegrationAPIIT that uses java.net.InetSocketAddress, java.net.InetSocketAddressjava.lang.String was not fulfilled within 2 minutes.
	at org.opennms.smoketest.IntegrationAPIIT.verifyHealthCheckWithDescription(IntegrationAPIIT.java:96)
	at org.opennms.smoketest.IntegrationAPIIT.canLoadSampleProject(IntegrationAPIIT.java:89)
Collapse Failed JmxConfigurationGeneratorIT testClickOnHeaderLinkWorks History
2 mins
org.openqa.selenium.NoSuchElementException: Unable to locate element: {"method":"link text","selector":"1. Service Configuration"}
Command duration or timeout: 120.13 seconds
For documentation on this error, please visit: http://seleniumhq.org/exceptions/no_such_element.html
Build info: version: '2.53.1', revision: 'a36b8b1cd5757287168e54b817830adce9b0158d', time: '2016-06-30 19:26:09'
System info: host: 'bambooagent01.internal.opennms.com', ip: '172.20.1.213', os.name: 'Linux', os.arch: 'amd64', os.version: '4.15.0-46-generic', java.version: '1.8.0_201'
Driver info: org.openqa.selenium.firefox.FirefoxDriver
Capabilities [{applicationCacheEnabled=true, rotatable=false, handlesAlerts=true, databaseEnabled=true, version=45.0.2, platform=LINUX, nativeEvents=false, acceptSslCerts=true, webStorageEnabled=true, locationContextEnabled=true, browserName=firefox, takesScreenshot=true, javascriptEnabled=true, cssSelectorsEnabled=true}]
Session ID: dc7640c4-4fbe-4317-9478-462c5fe50494
(18 more lines...)
Collapse Failed JmxConfigurationGeneratorIT testNavigation History
2 mins
org.openqa.selenium.TimeoutException: Timed out after 120 seconds waiting for org.opennms.smoketest.OpenNMSSeleniumTestCase$14@77483333
Build info: version: '2.53.1', revision: 'a36b8b1cd5757287168e54b817830adce9b0158d', time: '2016-06-30 19:26:09'
System info: host: 'bambooagent01.internal.opennms.com', ip: '172.20.1.213', os.name: 'Linux', os.arch: 'amd64', os.version: '4.15.0-46-generic', java.version: '1.8.0_201'
Driver info: org.openqa.selenium.firefox.FirefoxDriver
Capabilities [{applicationCacheEnabled=true, rotatable=false, handlesAlerts=true, databaseEnabled=true, version=45.0.2, platform=LINUX, nativeEvents=false, acceptSslCerts=true, webStorageEnabled=true, locationContextEnabled=true, browserName=firefox, takesScreenshot=true, javascriptEnabled=true, cssSelectorsEnabled=true}]
Session ID: 24d9a84d-54a4-4b40-a6be-1f1fba30eab8
org.openqa.selenium.TimeoutException: 
Timed out after 120 seconds waiting for org.opennms.smoketest.OpenNMSSeleniumTestCase$14@77483333
(7 more lines...)
Collapse Failed JmxConfigurationGeneratorIT verifyCompMemberSelection History
2 mins
org.openqa.selenium.TimeoutException: Timed out after 120 seconds waiting for org.opennms.smoketest.OpenNMSSeleniumTestCase$14@21b0ef39
Build info: version: '2.53.1', revision: 'a36b8b1cd5757287168e54b817830adce9b0158d', time: '2016-06-30 19:26:09'
System info: host: 'bambooagent01.internal.opennms.com', ip: '172.20.1.213', os.name: 'Linux', os.arch: 'amd64', os.version: '4.15.0-46-generic', java.version: '1.8.0_201'
Driver info: org.openqa.selenium.firefox.FirefoxDriver
Capabilities [{applicationCacheEnabled=true, rotatable=false, handlesAlerts=true, databaseEnabled=true, version=45.0.2, platform=LINUX, nativeEvents=false, acceptSslCerts=true, webStorageEnabled=true, locationContextEnabled=true, browserName=firefox, takesScreenshot=true, javascriptEnabled=true, cssSelectorsEnabled=true}]
Session ID: 5c8c8341-8e4d-46d3-a5f8-9f96ace9311e
org.openqa.selenium.TimeoutException: 
Timed out after 120 seconds waiting for org.opennms.smoketest.OpenNMSSeleniumTestCase$14@21b0ef39
(7 more lines...)
Collapse Failed KafkaPersisterIT testKafkaPersisterForMetrics History
2 mins
com.jayway.awaitility.core.ConditionTimeoutException: Lambda expression in org.opennms.smoketest.BaseKafkaPersisterIT: expected a string containing "Persisted collection" but was <
   ____                   _   _ __  __  _____  
  / __ \                 | \ | |  \/  |/ ____| 
 | |  | |_ __   ___ _ __ |  \| | \  / | (___   
 | |  | | '_ \ / _ \ '_ \| . ` | |\/| |\___ \  
 | |__| | |_) |  __/ | | | |\  | |  | |____) | 
  \____/| .__/ \___|_| |_|_| \_|_|  |_|_____/  
        | |                                    
(51 more lines...)
Collapse Failed KafkaProducerIT testKafkaAlarmStoreData History
2 mins
com.jayway.awaitility.core.ConditionTimeoutException: Lambda expression in org.opennms.smoketest.KafkaProducerIT: expected a string containing "uei.opennms.org/alarms/trigger:::kafka-producer-test" but was <
Command not found: kafka-producer:list-alarms
admin@opennms> logout
> within 2 minutes.
com.jayway.awaitility.core.ConditionTimeoutException: 
Lambda expression in org.opennms.smoketest.KafkaProducerIT: expected a string containing "uei.opennms.org/alarms/trigger:::kafka-producer-test" but was <

Command not found: kafka-producer:list-alarms
(4 more lines...)
Collapse Failed KafkaProducerIT testKafkaPersisterForMetrics History
2 mins
com.jayway.awaitility.core.ConditionTimeoutException: Lambda expression in org.opennms.smoketest.BaseKafkaPersisterIT: expected a string containing "Persisted collection" but was <
   ____                   _   _ __  __  _____  
  / __ \                 | \ | |  \/  |/ ____| 
 | |  | |_ __   ___ _ __ |  \| | \  / | (___   
 | |  | | '_ \ / _ \ '_ \| . ` | |\/| |\___ \  
 | |__| | |_) |  __/ | | | |\  | |  | |____) | 
  \____/| .__/ \___|_| |_|_| \_|_|  |_|_____/  
        | |                                    
(51 more lines...)
Collapse Failed MenuHeaderIT testMenuEntries History
2 mins
org.openqa.selenium.TimeoutException: Timed out after 120 seconds waiting for visibility of element located by By.xpath: //span[text()='Surveillance view: default']
Build info: version: '2.53.1', revision: 'a36b8b1cd5757287168e54b817830adce9b0158d', time: '2016-06-30 19:26:09'
System info: host: 'bambooagent01.internal.opennms.com', ip: '172.20.1.213', os.name: 'Linux', os.arch: 'amd64', os.version: '4.15.0-46-generic', java.version: '1.8.0_201'
Driver info: org.openqa.selenium.firefox.FirefoxDriver
Capabilities [{applicationCacheEnabled=true, rotatable=false, handlesAlerts=true, databaseEnabled=true, version=45.0.2, platform=LINUX, nativeEvents=false, acceptSslCerts=true, webStorageEnabled=true, locationContextEnabled=true, browserName=firefox, takesScreenshot=true, javascriptEnabled=true, cssSelectorsEnabled=true}]
Session ID: 81f726a6-f307-4333-aefd-281d46084377
org.openqa.selenium.TimeoutException: 
Timed out after 120 seconds waiting for visibility of element located by By.xpath: //span[text()='Surveillance view: default']
(23 more lines...)
Collapse Failed NodeDetailPageIT canUseViewInTopology History
2 mins
org.openqa.selenium.NoSuchElementException: Unable to locate element: {"method":"link text","selector":"View in Topology"}
Command duration or timeout: 120.19 seconds
For documentation on this error, please visit: http://seleniumhq.org/exceptions/no_such_element.html
Build info: version: '2.53.1', revision: 'a36b8b1cd5757287168e54b817830adce9b0158d', time: '2016-06-30 19:26:09'
System info: host: 'bambooagent01.internal.opennms.com', ip: '172.20.1.213', os.name: 'Linux', os.arch: 'amd64', os.version: '4.15.0-46-generic', java.version: '1.8.0_201'
Driver info: org.openqa.selenium.firefox.FirefoxDriver
Capabilities [{applicationCacheEnabled=true, rotatable=false, handlesAlerts=true, databaseEnabled=true, version=45.0.2, platform=LINUX, nativeEvents=false, acceptSslCerts=true, webStorageEnabled=true, locationContextEnabled=true, browserName=firefox, takesScreenshot=true, javascriptEnabled=true, cssSelectorsEnabled=true}]
Session ID: 6aa7bcb9-bca8-4c48-be06-6e41be820daa
(18 more lines...)
Collapse Failed ClassificationRestIT verifyCRUD History
12 secs
java.lang.AssertionError: 1 expectation failed.
Expected status code <200> but was <404>.

java.lang.AssertionError: 
1 expectation failed.
Expected status code <200> but was <404>.

	at org.opennms.smoketest.flow.ClassificationRestIT.setEnabled(ClassificationRestIT.java:333)
(1 more lines...)
Collapse Failed ClassificationRestIT verifyClassify History
12 secs
java.lang.AssertionError: 1 expectation failed.
Expected status code <200> but was <404>.

java.lang.AssertionError: 
1 expectation failed.
Expected status code <200> but was <404>.

	at org.opennms.smoketest.flow.ClassificationRestIT.setEnabled(ClassificationRestIT.java:333)
(1 more lines...)
Collapse Failed ClassificationRestIT verifyClassifyEmpty History
12 secs
java.lang.AssertionError: 1 expectation failed.
Expected status code <200> but was <404>.

java.lang.AssertionError: 
1 expectation failed.
Expected status code <200> but was <404>.

	at org.opennms.smoketest.flow.ClassificationRestIT.setEnabled(ClassificationRestIT.java:333)
(1 more lines...)
Collapse Failed ClassificationRestIT verifyCreateNull History
12 secs
java.lang.AssertionError: 1 expectation failed.
Expected status code <200> but was <404>.

java.lang.AssertionError: 
1 expectation failed.
Expected status code <200> but was <404>.

	at org.opennms.smoketest.flow.ClassificationRestIT.setEnabled(ClassificationRestIT.java:333)
(1 more lines...)
Collapse Failed ClassificationRestIT verifyDeleteNonExisting History
12 secs
java.lang.AssertionError: 1 expectation failed.
Expected status code <200> but was <404>.

java.lang.AssertionError: 
1 expectation failed.
Expected status code <200> but was <404>.

	at org.opennms.smoketest.flow.ClassificationRestIT.setEnabled(ClassificationRestIT.java:333)
(1 more lines...)
Collapse Failed ClassificationRestIT verifyDisableGroup History
12 secs
java.lang.AssertionError: 1 expectation failed.
Expected status code <200> but was <404>.

java.lang.AssertionError: 
1 expectation failed.
Expected status code <200> but was <404>.

	at org.opennms.smoketest.flow.ClassificationRestIT.setEnabled(ClassificationRestIT.java:333)
(1 more lines...)
Collapse Failed ClassificationRestIT verifyExportGroup History
12 secs
java.lang.AssertionError: 1 expectation failed.
Expected status code <200> but was <404>.

java.lang.AssertionError: 
1 expectation failed.
Expected status code <200> but was <404>.

	at org.opennms.smoketest.flow.ClassificationRestIT.setEnabled(ClassificationRestIT.java:333)
(1 more lines...)
Collapse Failed ClassificationRestIT verifyGetNonExisting History
12 secs
java.lang.AssertionError: 1 expectation failed.
Expected status code <200> but was <404>.

java.lang.AssertionError: 
1 expectation failed.
Expected status code <200> but was <404>.

	at org.opennms.smoketest.flow.ClassificationRestIT.setEnabled(ClassificationRestIT.java:333)
(1 more lines...)
Collapse Failed ClassificationRestIT verifyImport History
12 secs
java.lang.AssertionError: 1 expectation failed.
Expected status code <200> but was <404>.

java.lang.AssertionError: 
1 expectation failed.
Expected status code <200> but was <404>.

	at org.opennms.smoketest.flow.ClassificationRestIT.setEnabled(ClassificationRestIT.java:333)
(1 more lines...)
Collapse Failed ClassificationRestIT verifyProtocols History
12 secs
java.lang.AssertionError: 1 expectation failed.
Expected status code <200> but was <404>.

java.lang.AssertionError: 
1 expectation failed.
Expected status code <200> but was <404>.

	at org.opennms.smoketest.flow.ClassificationRestIT.setEnabled(ClassificationRestIT.java:333)
(1 more lines...)
Collapse Failed ClassificationRestIT verifyUpdateNonExisting History
15 secs
java.lang.AssertionError: 1 expectation failed.
Expected status code <200> but was <404>.

java.lang.AssertionError: 
1 expectation failed.
Expected status code <200> but was <404>.

	at org.opennms.smoketest.flow.ClassificationRestIT.setEnabled(ClassificationRestIT.java:333)
(1 more lines...)
Collapse Failed FlowStackIT verifyFlowStack History
2 mins
com.jayway.awaitility.core.ConditionTimeoutException: Condition with lambda expression in org.opennms.smoketest.telemetry.FlowTester that uses org.opennms.smoketest.telemetry.FlowTester$Block was not fulfilled within 1 minutes.
	at org.opennms.smoketest.flow.FlowStackIT.verifyFlowStack(FlowStackIT.java:98)
Collapse Failed SinglePortFlowsIT verifyFlowStack History
2 mins
com.jayway.awaitility.core.ConditionTimeoutException: Condition with lambda expression in org.opennms.smoketest.telemetry.FlowTester that uses org.opennms.smoketest.telemetry.FlowTester$Block was not fulfilled within 1 minutes.
	at org.opennms.smoketest.flow.SinglePortFlowsIT.verifyFlowStack(SinglePortFlowsIT.java:100)
Collapse Failed HealthCheckIT verifyOpenNMSHealth History
5 mins
com.jayway.awaitility.core.ConditionTimeoutException: Condition with lambda expression in org.opennms.smoketest.health.HealthCheckIT was not fulfilled within 5 minutes.
	at org.opennms.smoketest.health.HealthCheckIT.verifyHealthCheck(HealthCheckIT.java:126)
	at org.opennms.smoketest.health.HealthCheckIT.verifyOpenNMSHealth(HealthCheckIT.java:104)
Collapse Failed CollectorListIT canLoadCollectorsOnOpenNMS History
3 mins
com.jayway.awaitility.core.ConditionTimeoutException: Lambda expression in org.opennms.smoketest.minion.CollectorListIT: expected a collection with size <0> but was <[org.opennms.netmgt.collectd.SnmpCollector, org.opennms.netmgt.collectd.HttpCollector, org.opennms.netmgt.collectd.JdbcCollector, org.opennms.netmgt.collectd.Jsr160Collector, org.opennms.netmgt.collectd.VmwareCimCollector, org.opennms.netmgt.collectd.VmwareCollector, org.opennms.netmgt.collectd.WmiCollector, org.opennms.netmgt.collectd.WsManCollector, org.opennms.protocols.xml.collector.XmlCollector]> within 3 minutes.
	at org.opennms.smoketest.minion.CollectorListIT.canLoadCollectorsOnOpenNMS(CollectorListIT.java:119)
Collapse Failed DetectorsCommandIT canLoadDetectorsOnOpenNMS History
3 mins
com.jayway.awaitility.core.ConditionTimeoutException: Lambda expression in org.opennms.smoketest.minion.DetectorsCommandIT: expected a collection with size <0> but was <[BGP_Session, BSF, CITRIX, Cisco_IP_SLA, DHCP, DNS, Dell_OpenManageChassis, DiskUsage, DominoIIOP, FTP, GP, HOST-RESOURCES, HTTP, HTTPS, ICMP, IMAP, IMAPS, JDBC, JSR160, JdbcQueryDetector, JdbcStoredProcedureDetector, LDAP, LDAPS, LOOP, MSExchange, Memcached, NOTES, NRPE, NTP, OMSAStorage, PERC, POP3, SMB, SMTP, SNMP, SSH, TCP, TrivialTime, WEB, WMI, WS-Man, WsManWQLService, Win32Service]> within 3 minutes.
	at org.opennms.smoketest.minion.DetectorsCommandIT.canLoadDetectorsOnOpenNMS(DetectorsCommandIT.java:153)
Collapse Failed JMXCollectorIT canPerformAdhocJmxCollection History
3 mins
com.jayway.awaitility.core.ConditionTimeoutException: Lambda expression in org.opennms.smoketest.minion.JMXCollectorIT: expected a string containing "java_lang_type_OperatingSystem" but was < -l MINION org.opennms.netmgt.collectd.Jsr160Collector 127.0.0.1 port=18980
Command not found: collection:collect
admin@opennms> logout
> within 3 minutes.
com.jayway.awaitility.core.ConditionTimeoutException: 
Lambda expression in org.opennms.smoketest.minion.JMXCollectorIT: expected a string containing "java_lang_type_OperatingSystem" but was < -l MINION org.opennms.netmgt.collectd.Jsr160Collector 127.0.0.1 port=18980

Command not found: collection:collect
(4 more lines...)
Collapse Failed JtiTelemetryIT verifyJtiTelemetryOnMinion History
2 mins
com.jayway.awaitility.core.ConditionTimeoutException: Condition returned by method "matchRrdFileFromNodeResource" in class org.opennms.smoketest.minion.JtiTelemetryIT was not fulfilled within 2 minutes.
	at org.opennms.smoketest.minion.JtiTelemetryIT.verifyJtiTelemetryOnMinion(JtiTelemetryIT.java:182)
Collapse Failed JtiTelemetryIT verifyJtiTelemetryOnOpenNMS History
45 secs
com.jayway.awaitility.core.ConditionTimeoutException: Condition returned by method "matchRrdFileFromNodeResource" in class org.opennms.smoketest.minion.JtiTelemetryIT was not fulfilled within 30 seconds.
	at org.opennms.smoketest.minion.JtiTelemetryIT.verifyJtiTelemetryOnOpenNMS(JtiTelemetryIT.java:151)
Collapse Failed MonitorsListCommandIT canLoadMonitorsOnOpenNMS History
3 mins
com.jayway.awaitility.core.ConditionTimeoutException: Lambda expression in org.opennms.smoketest.minion.MonitorsListCommandIT: expected a collection with size <0> but was <[org.opennms.netmgt.poller.monitors.DNSResolutionMonitor, org.opennms.netmgt.poller.monitors.JDBCQueryMonitor, org.opennms.netmgt.poller.monitors.DskTableMonitor, org.opennms.netmgt.poller.monitors.SmbMonitor, org.opennms.netmgt.poller.monitors.HttpMonitor, org.opennms.netmgt.poller.monitors.PercMonitor, org.opennms.netmgt.poller.monitors.HttpsMonitor, org.opennms.netmgt.poller.monitors.SSLCertMonitor, org.opennms.netmgt.poller.monitors.MailTransportMonitor, org.opennms.netmgt.poller.monitors.OpenManageChassisMonitor, org.opennms.netmgt.poller.monitors.BgpSessionMonitor, org.opennms.netmgt.poller.monitors.TcpMonitor, org.opennms.netmgt.poller.monitors.MemcachedMonitor, org.opennms.netmgt.poller.monitors.ImapMonitor, org.opennms.netmgt.poller.monitors.SshMonitor, org.opennms.netmgt.poller.monitors.PageSequenceMonitor, org.opennms.netmgt.poller.monitors.LaTableMonitor, org.opennms.netmgt.poller.monitors.HttpPostMonitor, org.opennms.netmgt.poller.monitors.Jsr160Monitor, org.opennms.netmgt.poller.monitors.LdapsMonitor, org.opennms.netmgt.poller.monitors.ImapsMonitor, org.opennms.netmgt.poller.monitors.DiskUsageMonitor, org.opennms.netmgt.poller.monitors.SystemExecuteMonitor, org.opennms.netmgt.poller.monitors.CitrixMonitor, org.opennms.netmgt.poller.monitors.SmtpMonitor, org.opennms.netmgt.poller.monitors.TrivialTimeMonitor, org.opennms.netmgt.poller.monitors.JolokiaBeanMonitor, org.opennms.netmgt.poller.monitors.LoopMonitor, org.opennms.netmgt.poller.monitors.FtpMonitor, org.opennms.netmgt.poller.monitors.NrpeMonitor, org.opennms.netmgt.poller.monitors.AvailabilityMonitor, org.opennms.netmgt.poller.monitors.LogMatchTableMonitor, org.opennms.netmgt.poller.monitors.Win32ServiceMonitor, org.opennms.netmgt.poller.monitors.NtpMonitor, org.opennms.netmgt.poller.monitors.CiscoPingMibMonitor, org.opennms.netmgt.poller.monitors.StrafePingMonitor, org.opennms.netmgt.poller.monitors.LdapMonitor, org.opennms.netmgt.poller.monitors.Pop3Monitor, org.opennms.netmgt.poller.monitors.DominoIIOPMonitor, org.opennms.netmgt.poller.monitors.DnsMonitor, org.opennms.netmgt.poller.monitors.SnmpMonitor, org.opennms.netmgt.poller.monitors.PrTableMonitor, org.opennms.netmgt.poller.monitors.IcmpMonitor, org.opennms.netmgt.poller.monitors.JDBCMonitor, org.opennms.netmgt.poller.monitors.JDBCStoredProcedureMonitor, org.opennms.netmgt.poller.monitors.BSFMonitor, org.opennms.netmgt.poller.monitors.OmsaStorageMonitor, org.opennms.netmgt.poller.monitors.HostResourceSwRunMonitor, org.opennms.netmgt.poller.monitors.NetScalerGroupHealthMonitor, org.opennms.netmgt.poller.monitors.WebMonitor, org.opennms.netmgt.poller.monitors.CiscoIpSlaMonitor, org.opennms.netmgt.poller.monitors.VmwareMonitor, org.opennms.netmgt.poller.monitors.VmwareCimMonitor, org.opennms.netmgt.poller.monitors.WsManMonitor, org.opennms.netmgt.poller.monitors.DhcpMonitor]> within 3 minutes.
	at org.opennms.smoketest.minion.MonitorsListCommandIT.canLoadMonitorsOnOpenNMS(MonitorsListCommandIT.java:153)
Collapse Failed NxosTelemetryIT verifyNxosTelemetryOnMinion History
2 mins
com.jayway.awaitility.core.ConditionTimeoutException: Condition returned by method "matchRrdFileFromNodeResource" in class org.opennms.smoketest.minion.NxosTelemetryIT was not fulfilled within 2 minutes.
	at org.opennms.smoketest.minion.NxosTelemetryIT.verifyNxosTelemetryOnMinion(NxosTelemetryIT.java:162)
Collapse Failed NxosTelemetryIT verifyNxosTelemetryOnOpenNMS History
1 min
com.jayway.awaitility.core.ConditionTimeoutException: Condition returned by method "matchRrdFileFromNodeResource" in class org.opennms.smoketest.minion.NxosTelemetryIT was not fulfilled within 30 seconds.
	at org.opennms.smoketest.minion.NxosTelemetryIT.verifyNxosTelemetryOnOpenNMS(NxosTelemetryIT.java:132)
Collapse Failed SyslogKafkaElasticsearch5IT testMinionSyslogsOverKafkaToEsRest History
8 mins
com.jayway.awaitility.core.ConditionTimeoutException: Condition with lambda expression in org.opennms.smoketest.minion.AbstractSyslogTestCase that uses java.util.function.Supplier, java.util.function.Supplierjava.util.function.Supplier, java.util.function.Supplierint was not fulfilled within 5 minutes.
	at org.opennms.smoketest.minion.SyslogKafkaElasticsearch5IT.testMinionSyslogsOverKafkaToEsRest(SyslogKafkaElasticsearch5IT.java:139)
Collapse Failed SyslogKafkaElasticsearch5OutageIT testMinionSyslogsOverKafkaToEsRest History
8 mins
com.jayway.awaitility.core.ConditionTimeoutException: Condition with lambda expression in org.opennms.smoketest.minion.AbstractSyslogTestCase that uses java.util.function.Supplier, java.util.function.Supplierjava.util.function.Supplier, java.util.function.Supplierint was not fulfilled within 5 minutes.
	at org.opennms.smoketest.minion.SyslogKafkaElasticsearch5OutageIT.testMinionSyslogsOverKafkaToEsRest(SyslogKafkaElasticsearch5OutageIT.java:173)
Collapse Failed SyslogKafkaElasticsearch6IT testMinionSyslogsOverKafkaToEsRest History
8 mins
com.jayway.awaitility.core.ConditionTimeoutException: Condition with lambda expression in org.opennms.smoketest.minion.AbstractSyslogTestCase that uses java.util.function.Supplier, java.util.function.Supplierjava.util.function.Supplier, java.util.function.Supplierint was not fulfilled within 5 minutes.
	at org.opennms.smoketest.minion.SyslogKafkaElasticsearch6IT.testMinionSyslogsOverKafkaToEsRest(SyslogKafkaElasticsearch6IT.java:139)
Collapse Failed SyslogKafkaElasticsearchBufferingIT testMinionSyslogsOverKafkaToEsRest History
9 mins
com.jayway.awaitility.core.ConditionTimeoutException: Condition with lambda expression in org.opennms.smoketest.minion.AbstractSyslogTestCase that uses java.util.function.Supplier, java.util.function.Supplierjava.util.function.Supplier, java.util.function.Supplierint was not fulfilled within 5 minutes.
	at org.opennms.smoketest.minion.SyslogKafkaElasticsearchBufferingIT.testMinionSyslogsOverKafkaToEsRest(SyslogKafkaElasticsearchBufferingIT.java:180)
Collapse Failed OpsBoardAdminPageIT canCreateAndPreview History
2 mins
org.openqa.selenium.NoSuchElementException: Unable to locate element: {"method":"xpath","selector":"//div[@class='v-captiontext' and contains(text(), '+')]"}
Command duration or timeout: 120.02 seconds
For documentation on this error, please visit: http://seleniumhq.org/exceptions/no_such_element.html
Build info: version: '2.53.1', revision: 'a36b8b1cd5757287168e54b817830adce9b0158d', time: '2016-06-30 19:26:09'
System info: host: 'bambooagent01.internal.opennms.com', ip: '172.20.1.213', os.name: 'Linux', os.arch: 'amd64', os.version: '4.15.0-46-generic', java.version: '1.8.0_201'
Driver info: org.openqa.selenium.firefox.FirefoxDriver
Capabilities [{applicationCacheEnabled=true, rotatable=false, handlesAlerts=true, databaseEnabled=true, version=45.0.2, platform=LINUX, nativeEvents=false, acceptSslCerts=true, webStorageEnabled=true, locationContextEnabled=true, browserName=firefox, takesScreenshot=true, javascriptEnabled=true, cssSelectorsEnabled=true}]
Session ID: 8fabb232-c5d6-4332-adf3-56c529cd08a4
(18 more lines...)
Existing test failures 23
Status Test Failing since Duration
java.lang.IllegalStateException: Failed to load ApplicationContext
Caused by: java.lang.IllegalArgumentException: Cannot load an ApplicationContext with a NULL 'contextLoader'. Consider annotating your test class with @ContextConfiguration or @ContextHierarchy.
java.lang.IllegalStateException: Failed to load ApplicationContext
Caused by: java.lang.IllegalArgumentException: Cannot load an ApplicationContext with a NULL 'contextLoader'. Consider annotating your test class with @ContextConfiguration or @ContextHierarchy.
java.lang.IllegalStateException: Failed to load ApplicationContext
Caused by: java.lang.IllegalArgumentException: Cannot load an ApplicationContext with a NULL 'contextLoader'. Consider annotating your test class with @ContextConfiguration or @ContextHierarchy.
java.lang.IllegalStateException: Failed to load ApplicationContext
Caused by: java.lang.IllegalArgumentException: Cannot load an ApplicationContext with a NULL 'contextLoader'. Consider annotating your test class with @ContextConfiguration or @ContextHierarchy.
java.lang.IllegalStateException: Failed to load ApplicationContext
Caused by: java.lang.IllegalArgumentException: Cannot load an ApplicationContext with a NULL 'contextLoader'. Consider annotating your test class with @ContextConfiguration or @ContextHierarchy.
java.lang.IllegalStateException: Failed to load ApplicationContext
Caused by: java.lang.IllegalArgumentException: Cannot load an ApplicationContext with a NULL 'contextLoader'. Consider annotating your test class with @ContextConfiguration or @ContextHierarchy.
java.lang.IllegalStateException: Failed to load ApplicationContext
Caused by: java.lang.IllegalArgumentException: Cannot load an ApplicationContext with a NULL 'contextLoader'. Consider annotating your test class with @ContextConfiguration or @ContextHierarchy.
java.lang.IllegalStateException: Failed to load ApplicationContext
Caused by: java.lang.IllegalArgumentException: Cannot load an ApplicationContext with a NULL 'contextLoader'. Consider annotating your test class with @ContextConfiguration or @ContextHierarchy.
java.lang.IllegalStateException: Failed to load ApplicationContext
Caused by: java.lang.IllegalArgumentException: Cannot load an ApplicationContext with a NULL 'contextLoader'. Consider annotating your test class with @ContextConfiguration or @ContextHierarchy.
java.lang.IllegalStateException: Failed to load ApplicationContext
Caused by: java.lang.IllegalArgumentException: Cannot load an ApplicationContext with a NULL 'contextLoader'. Consider annotating your test class with @ContextConfiguration or @ContextHierarchy.
java.lang.IllegalStateException: Failed to load ApplicationContext
Caused by: java.lang.IllegalArgumentException: Cannot load an ApplicationContext with a NULL 'contextLoader'. Consider annotating your test class with @ContextConfiguration or @ContextHierarchy.
java.lang.IllegalStateException: Failed to load ApplicationContext
Caused by: java.lang.IllegalArgumentException: Cannot load an ApplicationContext with a NULL 'contextLoader'. Consider annotating your test class with @ContextConfiguration or @ContextHierarchy.
java.lang.IllegalStateException: Failed to load ApplicationContext
Caused by: java.lang.IllegalArgumentException: Cannot load an ApplicationContext with a NULL 'contextLoader'. Consider annotating your test class with @ContextConfiguration or @ContextHierarchy.
java.lang.IllegalStateException: Failed to load ApplicationContext
Caused by: java.lang.IllegalArgumentException: Cannot load an ApplicationContext with a NULL 'contextLoader'. Consider annotating your test class with @ContextConfiguration or @ContextHierarchy.
java.lang.IllegalStateException: Failed to load ApplicationContext
Caused by: java.lang.IllegalArgumentException: Cannot load an ApplicationContext with a NULL 'contextLoader'. Consider annotating your test class with @ContextConfiguration or @ContextHierarchy.
java.lang.IllegalStateException: Failed to load ApplicationContext
Caused by: java.lang.IllegalArgumentException: Cannot load an ApplicationContext with a NULL 'contextLoader'. Consider annotating your test class with @ContextConfiguration or @ContextHierarchy.
java.lang.IllegalStateException: Failed to load ApplicationContext
Caused by: java.lang.IllegalArgumentException: Cannot load an ApplicationContext with a NULL 'contextLoader'. Consider annotating your test class with @ContextConfiguration or @ContextHierarchy.
java.lang.IllegalStateException: Failed to load ApplicationContext
Caused by: java.lang.IllegalArgumentException: Cannot load an ApplicationContext with a NULL 'contextLoader'. Consider annotating your test class with @ContextConfiguration or @ContextHierarchy.
java.lang.IllegalStateException: Failed to load ApplicationContext
Caused by: java.lang.IllegalArgumentException: Cannot load an ApplicationContext with a NULL 'contextLoader'. Consider annotating your test class with @ContextConfiguration or @ContextHierarchy.
java.lang.IllegalStateException: Failed to load ApplicationContext
Caused by: java.lang.IllegalArgumentException: Cannot load an ApplicationContext with a NULL 'contextLoader'. Consider annotating your test class with @ContextConfiguration or @ContextHierarchy.
org.openqa.selenium.TimeoutException: Timed out after 120 seconds waiting for element to be clickable: By.xpath: //span[@class='v-menubar-menuitem-caption' and text()='View']/parent::*
Build info: version: '2.53.1', revision: 'a36b8b1cd5757287168e54b817830adce9b0158d', time: '2016-06-30 19:26:09'
System info: host: 'bambooagent01.internal.opennms.com', ip: '172.20.1.213', os.name: 'Linux', os.arch: 'amd64', os.version: '4.15.0-46-generic', java.version: '1.8.0_201'
Driver info: org.openqa.selenium.firefox.FirefoxDriver
Capabilities [{applicationCacheEnabled=true, rotatable=false, handlesAlerts=true, databaseEnabled=true, version=45.0.2, platform=LINUX, nativeEvents=false, acceptSslCerts=true, webStorageEnabled=true, locationContextEnabled=true, browserName=firefox, takesScreenshot=true, javascriptEnabled=true, cssSelectorsEnabled=true}]
Session ID: f35daa1e-c9de-4658-bb27-fb312fab6c38
org.openqa.selenium.TimeoutException: 
Timed out after 120 seconds waiting for element to be clickable: By.xpath: //span[@class='v-menubar-menuitem-caption' and text()='View']/parent::*
(23 more lines...)
com.jayway.awaitility.core.ConditionTimeoutException: Lambda expression in org.opennms.smoketest.minion.RpcOverKafkaIT: expected a string containing "'ICMP' WAS detected on 127.0.0.1" but was <
logout

   ____                   _   _ __  __  _____  
  / __ \                 | \ | |  \/  |/ ____| 
 | |  | |_ __   ___ _ __ |  \| | \  / | (___   
 | |  | | '_ \ / _ \ '_ \| . ` | |\/| |\___ \  
 | |__| | |_) |  __/ | | | |\  | |  | |____) | 
(55 more lines...)
com.jayway.awaitility.core.ConditionTimeoutException: Lambda expression in org.opennms.smoketest.minion.RpcOverKafkaIT: expected a string containing "'JDBC' WAS detected" but was < 172.17.0.3 url=jdbc:postgresql://172.17.0.3:5432/opennms
Command not found: detect
admin@opennms> logout
> within 3 minutes.
com.jayway.awaitility.core.ConditionTimeoutException: 
Lambda expression in org.opennms.smoketest.minion.RpcOverKafkaIT: expected a string containing "'JDBC' WAS detected" but was < 172.17.0.3 url=jdbc:postgresql://172.17.0.3:5432/opennms

Command not found: detect
(4 more lines...)
Fixed tests 1
Status Test Failing since Duration
Successful SFlowTelemetryAdapterIT verifyAdapter History
Failing since build #115 (Code changes detected) 3 mins

Error summary

The build generated some errors. See the full build log for more details.

No Match for argument: opennms-upgrade
No Match for argument: meridian-upgrade
No Match for argument: opennms-docs
No Match for argument: meridian-docs
No Match for argument: opennms-core
No Match for argument: meridian-core
No Match for argument: opennms-plugin-ticketer-centric
No Match for argument: meridian-plugin-ticketer-centric
No Match for argument: opennms-source
No Match for argument: meridian-source
No Match for argument: opennms-remote-poller
No Match for argument: meridian-remote-poller
No Match for argument: opennms-minion-core
No Match for argument: meridian-minion-core
No Match for argument: opennms-minion-features
No Match for argument: meridian-minion-features
No Match for argument: opennms-minion-container
No Match for argument: meridian-minion-container
++ dirname /home/bamboo/ci/bamboo/xml-data/build-dir/OPENNMS-OF-SMOKEFLAP/.opennms-bamboo-utils/smoke-tests.sh
+ MYDIR=/home/bamboo/ci/bamboo/xml-data/build-dir/OPENNMS-OF-SMOKEFLAP/.opennms-bamboo-utils
++ cd /home/bamboo/ci/bamboo/xml-data/build-dir/OPENNMS-OF-SMOKEFLAP/.opennms-bamboo-utils
++ pwd
+ MYDIR=/home/bamboo/ci/bamboo/xml-data/build-dir/OPENNMS-OF-SMOKEFLAP/.opennms-bamboo-utils
+ . /home/bamboo/ci/bamboo/xml-data/build-dir/OPENNMS-OF-SMOKEFLAP/.opennms-bamboo-utils/lib.sh
++ WORKDIR=/home/bamboo/ci/bamboo/xml-data/build-dir/OPENNMS-OF-SMOKEFLAP
++ shift
++ '[' -z /home/bamboo/ci/bamboo/xml-data/build-dir/OPENNMS-OF-SMOKEFLAP ']'
++ '[' '!' -d /home/bamboo/ci/bamboo/xml-data/build-dir/OPENNMS-OF-SMOKEFLAP ']'
++ '[' -z /home/bamboo/ci/bamboo/xml-data/build-dir/OPENNMS-OF-SMOKEFLAP/.opennms-bamboo-utils ']'
++ '[' '!' -d /home/bamboo/ci/bamboo/xml-data/build-dir/OPENNMS-OF-SMOKEFLAP/.opennms-bamboo-utils ']'
++ . /home/bamboo/ci/bamboo/xml-data/build-dir/OPENNMS-OF-SMOKEFLAP/.opennms-bamboo-utils/environment.sh
+++ '[' -z OPENNMS-OF-SMOKEFLAP ']'
+++ export M2_LOCAL_REPOSITORY=/home/bamboo/.m2/repository-OPENNMS-OF-SMOKEFLAP
+++ M2_LOCAL_REPOSITORY=/home/bamboo/.m2/repository-OPENNMS-OF-SMOKEFLAP
+++ export JICMP_USE_SOCK_DGRAM=1
+++ JICMP_USE_SOCK_DGRAM=1
+++ COMPILE_OPTIONS=("-DupdatePolicy=never" "-Dmaxmemory=2g" "-Dorg.ops4j.pax.url.mvn.localRepository=$M2_LOCAL_REPOSITORY" "-Daether.connector.basic.threads=1" "-Daether.connector.resumeDownloads=false" "--batch-mode" "-Dorg.slf4j.simpleLogger.log.org.apache.maven.cli.transfer.Slf4jMavenTransferListener=warn")
+++ export COMPILE_OPTIONS
+++ SKIP_TESTS=("-Dmaven.test.skip.exec=true" "-DskipITs=true")
+++ export SKIP_TESTS
+++ ENABLE_TESTS=("-Dmaven.test.skip.exec=false" "-DskipITs=false")
+++ export ENABLE_TESTS
+++ export PATH=/usr/local/bin:/home/bamboo/ci:/home/bamboo/ci/java/java-default/bin:/usr/ccs/bin:/usr/xpg4/bin:/usr/local/node/bin:/home/bamboo/ci:/home/bamboo/ci/java/java-default/bin:/usr/ccs/bin:/usr/xpg4/bin:/usr/local/node/bin:/usr/bin:/bin:/usr/local/bin:/usr/local/bin
+++ PATH=/usr/local/bin:/home/bamboo/ci:/home/bamboo/ci/java/java-default/bin:/usr/ccs/bin:/usr/xpg4/bin:/usr/local/node/bin:/home/bamboo/ci:/home/bamboo/ci/java/java-default/bin:/usr/ccs/bin:/usr/xpg4/bin:/usr/local/node/bin:/usr/bin:/bin:/usr/local/bin:/usr/local/bin
+++ export BAMBOO_BUILD_NUMBER=116
+++ BAMBOO_BUILD_NUMBER=116
+++ export BAMBOO_WORKING_DIRECTORY=/home/bamboo/ci/bamboo/xml-data/build-dir/OPENNMS-OF-SMOKEFLAP
+++ BAMBOO_WORKING_DIRECTORY=/home/bamboo/ci/bamboo/xml-data/build-dir/OPENNMS-OF-SMOKEFLAP
+++ '[' -z '' ']'
+++ MAVEN_OPTS='-Xmx2048m -XX:ReservedCodeCacheSize=512m'
++ set -euo pipefail
+ set +eo pipefail
+ FLAPPING=false
+ getopts f OPT
+ case $OPT in
+ FLAPPING=true
+ getopts f OPT
+ '[' true = true ']'
++ git grep runFlappers
++ grep IfProfileValue
++ wc -l
+ FLAPPING_TESTS=0
+ '[' 0 -gt 0 ']'
+ echo '* Running flapping tests.'
+ export PATH=/opt/firefox:/usr/local/bin:/usr/local/bin:/home/bamboo/ci:/home/bamboo/ci/java/java-default/bin:/usr/ccs/bin:/usr/xpg4/bin:/usr/local/node/bin:/home/bamboo/ci:/home/bamboo/ci/java/java-default/bin:/usr/ccs/bin:/usr/xpg4/bin:/usr/local/node/bin:/usr/bin:/bin:/usr/local/bin:/usr/local/bin
+ PATH=/opt/firefox:/usr/local/bin:/usr/local/bin:/home/bamboo/ci:/home/bamboo/ci/java/java-default/bin:/usr/ccs/bin:/usr/xpg4/bin:/usr/local/node/bin:/home/bamboo/ci:/home/bamboo/ci/java/java-default/bin:/usr/ccs/bin:/usr/xpg4/bin:/usr/local/node/bin:/usr/bin:/bin:/usr/local/bin:/usr/local/bin
+ export PHANTOMJS_CDNURL=https://mirror.internal.opennms.com/phantomjs/
+ PHANTOMJS_CDNURL=https://mirror.internal.opennms.com/phantomjs/
+ '[' -x /home/bamboo/ci/bamboo/xml-data/build-dir/OPENNMS-OF-SMOKEFLAP/opennms-source/bin/javahome.pl ']'
++ /home/bamboo/ci/bamboo/xml-data/build-dir/OPENNMS-OF-SMOKEFLAP/opennms-source/bin/javahome.pl
+ JAVA_HOME=/usr/lib/jvm/java-8-oracle
+ export JAVA_HOME
++ find rpms -name 'opennms-core-*.rpm' -o -name 'meridian-core-*.rpm'
+ CORE_RPM=rpms/opennms-core-25.0.0-0.20190322.of.develop.116.noarch.rpm
++ echo rpms/opennms-core-25.0.0-0.20190322.of.develop.116.noarch.rpm
++ wc -w
+ '[' 1 -ne 1 ']'
++ rpm -q '--queryformat=%{version}-%{release}\n' -p rpms/opennms-core-25.0.0-0.20190322.of.develop.116.noarch.rpm
+ RPM_VERSION=25.0.0-0.20190322.of.develop.116
+ echo 'RPM Version: 25.0.0-0.20190322.of.develop.116'
+ ls -1 /home/bamboo/ci/bamboo/xml-data/build-dir/OPENNMS-OF-SMOKEFLAP/rpms/opennms-25.0.0-0.20190322.of.develop.116.noarch.rpm /home/bamboo/ci/bamboo/xml-data/build-dir/OPENNMS-OF-SMOKEFLAP/rpms/opennms-core-25.0.0-0.20190322.of.develop.116.noarch.rpm /home/bamboo/ci/bamboo/xml-data/build-dir/OPENNMS-OF-SMOKEFLAP/rpms/opennms-docs-25.0.0-0.20190322.of.develop.116.noarch.rpm /home/bamboo/ci/bamboo/xml-data/build-dir/OPENNMS-OF-SMOKEFLAP/rpms/opennms-jmx-config-generator-25.0.0-0.20190322.of.develop.116.noarch.rpm /home/bamboo/ci/bamboo/xml-data/build-dir/OPENNMS-OF-SMOKEFLAP/rpms/opennms-minion-25.0.0-0.20190322.of.develop.116.noarch.rpm /home/bamboo/ci/bamboo/xml-data/build-dir/OPENNMS-OF-SMOKEFLAP/rpms/opennms-minion-container-25.0.0-0.20190322.of.develop.116.noarch.rpm /home/bamboo/ci/bamboo/xml-data/build-dir/OPENNMS-OF-SMOKEFLAP/rpms/opennms-minion-features-core-25.0.0-0.20190322.of.develop.116.noarch.rpm /home/bamboo/ci/bamboo/xml-data/build-dir/OPENNMS-OF-SMOKEFLAP/rpms/opennms-minion-features-default-25.0.0-0.20190322.of.develop.116.noarch.rpm /home/bamboo/ci/bamboo/xml-data/build-dir/OPENNMS-OF-SMOKEFLAP/rpms/opennms-plugin-collector-juniper-tca-25.0.0-0.20190322.of.develop.116.noarch.rpm /home/bamboo/ci/bamboo/xml-data/build-dir/OPENNMS-OF-SMOKEFLAP/rpms/opennms-plugin-collector-vtdxml-handler-25.0.0-0.20190322.of.develop.116.noarch.rpm /home/bamboo/ci/bamboo/xml-data/build-dir/OPENNMS-OF-SMOKEFLAP/rpms/opennms-plugin-northbounder-jms-25.0.0-0.20190322.of.develop.116.noarch.rpm /home/bamboo/ci/bamboo/xml-data/build-dir/OPENNMS-OF-SMOKEFLAP/rpms/opennms-plugin-protocol-cifs-25.0.0-0.20190322.of.develop.116.noarch.rpm /home/bamboo/ci/bamboo/xml-data/build-dir/OPENNMS-OF-SMOKEFLAP/rpms/opennms-plugin-protocol-nsclient-25.0.0-0.20190322.of.develop.116.noarch.rpm /home/bamboo/ci/bamboo/xml-data/build-dir/OPENNMS-OF-SMOKEFLAP/rpms/opennms-plugin-protocol-radius-25.0.0-0.20190322.of.develop.116.noarch.rpm /home/bamboo/ci/bamboo/xml-data/build-dir/OPENNMS-OF-SMOKEFLAP/rpms/opennms-plugin-protocol-xmp-25.0.0-0.20190322.of.develop.116.noarch.rpm /home/bamboo/ci/bamboo/xml-data/build-dir/OPENNMS-OF-SMOKEFLAP/rpms/opennms-plugin-provisioning-dns-25.0.0-0.20190322.of.develop.116.noarch.rpm /home/bamboo/ci/bamboo/xml-data/build-dir/OPENNMS-OF-SMOKEFLAP/rpms/opennms-plugin-provisioning-rancid-25.0.0-0.20190322.of.develop.116.noarch.rpm /home/bamboo/ci/bamboo/xml-data/build-dir/OPENNMS-OF-SMOKEFLAP/rpms/opennms-plugin-provisioning-reverse-dns-25.0.0-0.20190322.of.develop.116.noarch.rpm /home/bamboo/ci/bamboo/xml-data/build-dir/OPENNMS-OF-SMOKEFLAP/rpms/opennms-plugin-provisioning-snmp-asset-25.0.0-0.20190322.of.develop.116.noarch.rpm /home/bamboo/ci/bamboo/xml-data/build-dir/OPENNMS-OF-SMOKEFLAP/rpms/opennms-plugin-provisioning-snmp-hardware-inventory-25.0.0-0.20190322.of.develop.116.noarch.rpm /home/bamboo/ci/bamboo/xml-data/build-dir/OPENNMS-OF-SMOKEFLAP/rpms/opennms-plugin-provisioning-wsman-asset-25.0.0-0.20190322.of.develop.116.noarch.rpm /home/bamboo/ci/bamboo/xml-data/build-dir/OPENNMS-OF-SMOKEFLAP/rpms/opennms-plugins-25.0.0-0.20190322.of.develop.116.noarch.rpm /home/bamboo/ci/bamboo/xml-data/build-dir/OPENNMS-OF-SMOKEFLAP/rpms/opennms-plugin-ticketer-centric-25.0.0-0.20190322.of.develop.116.noarch.rpm /home/bamboo/ci/bamboo/xml-data/build-dir/OPENNMS-OF-SMOKEFLAP/rpms/opennms-plugin-ticketer-jira-25.0.0-0.20190322.of.develop.116.noarch.rpm /home/bamboo/ci/bamboo/xml-data/build-dir/OPENNMS-OF-SMOKEFLAP/rpms/opennms-plugin-ticketer-otrs-25.0.0-0.20190322.of.develop.116.noarch.rpm /home/bamboo/ci/bamboo/xml-data/build-dir/OPENNMS-OF-SMOKEFLAP/rpms/opennms-plugin-ticketer-rt-25.0.0-0.20190322.of.develop.116.noarch.rpm /home/bamboo/ci/bamboo/xml-data/build-dir/OPENNMS-OF-SMOKEFLAP/rpms/opennms-remote-poller-25.0.0-0.20190322.of.develop.116.noarch.rpm /home/bamboo/ci/bamboo/xml-data/build-dir/OPENNMS-OF-SMOKEFLAP/rpms/opennms-sentinel-25.0.0-0.20190322.of.develop.116.noarch.rpm /home/bamboo/ci/bamboo/xml-data/build-dir/OPENNMS-OF-SMOKEFLAP/rpms/opennms-source-25.0.0-0.20190322.of.develop.116.noarch.rpm /home/bamboo/ci/bamboo/xml-data/build-dir/OPENNMS-OF-SMOKEFLAP/rpms/opennms-webapp-hawtio-25.0.0-0.20190322.of.develop.116.noarch.rpm /home/bamboo/ci/bamboo/xml-data/build-dir/OPENNMS-OF-SMOKEFLAP/rpms/opennms-webapp-jetty-25.0.0-0.20190322.of.develop.116.noarch.rpm /home/bamboo/ci/bamboo/xml-data/build-dir/OPENNMS-OF-SMOKEFLAP/rpms/opennms-webapp-remoting-25.0.0-0.20190322.of.develop.116.noarch.rpm
++ grep -C1 org.opennms.smoke.test-api /home/bamboo/ci/bamboo/xml-data/build-dir/OPENNMS-OF-SMOKEFLAP/opennms-source/smoke-test/pom.xml
++ grep '<version>'
++ sed -e 's,.*<version>,,' -e 's,</version>,,' -e 's,-SNAPSHOT$,,'
+ SMOKE_TEST_API_VERSION=2
+ case "$SMOKE_TEST_API_VERSION" in
+ DOCKERDIR=/home/bamboo/ci/bamboo/xml-data/build-dir/OPENNMS-OF-SMOKEFLAP/opennms-system-test-api/docker
+ echo '* Found Dockerized smoke tests'
+ case "$SMOKE_TEST_API_VERSION" in
+ mkdir -p /home/bamboo/ci/bamboo/xml-data/build-dir/OPENNMS-OF-SMOKEFLAP/opennms-system-test-api/docker/opennms/rpms /home/bamboo/ci/bamboo/xml-data/build-dir/OPENNMS-OF-SMOKEFLAP/opennms-system-test-api/docker/minion/rpms /home/bamboo/ci/bamboo/xml-data/build-dir/OPENNMS-OF-SMOKEFLAP/opennms-system-test-api/docker/sentinel/rpms
+ rm -rf '/home/bamboo/ci/bamboo/xml-data/build-dir/OPENNMS-OF-SMOKEFLAP/opennms-system-test-api/docker/opennms/rpms/*.rpm' '/home/bamboo/ci/bamboo/xml-data/build-dir/OPENNMS-OF-SMOKEFLAP/opennms-system-test-api/docker/minion/rpms/*.rpm' '/home/bamboo/ci/bamboo/xml-data/build-dir/OPENNMS-OF-SMOKEFLAP/opennms-system-test-api/docker/sentinel/rpms/*.rpm'
+ mv /home/bamboo/ci/bamboo/xml-data/build-dir/OPENNMS-OF-SMOKEFLAP/rpms/opennms-25.0.0-0.20190322.of.develop.116.noarch.rpm /home/bamboo/ci/bamboo/xml-data/build-dir/OPENNMS-OF-SMOKEFLAP/rpms/opennms-core-25.0.0-0.20190322.of.develop.116.noarch.rpm /home/bamboo/ci/bamboo/xml-data/build-dir/OPENNMS-OF-SMOKEFLAP/rpms/opennms-docs-25.0.0-0.20190322.of.develop.116.noarch.rpm /home/bamboo/ci/bamboo/xml-data/build-dir/OPENNMS-OF-SMOKEFLAP/rpms/opennms-jmx-config-generator-25.0.0-0.20190322.of.develop.116.noarch.rpm /home/bamboo/ci/bamboo/xml-data/build-dir/OPENNMS-OF-SMOKEFLAP/rpms/opennms-minion-25.0.0-0.20190322.of.develop.116.noarch.rpm /home/bamboo/ci/bamboo/xml-data/build-dir/OPENNMS-OF-SMOKEFLAP/rpms/opennms-minion-container-25.0.0-0.20190322.of.develop.116.noarch.rpm /home/bamboo/ci/bamboo/xml-data/build-dir/OPENNMS-OF-SMOKEFLAP/rpms/opennms-minion-features-core-25.0.0-0.20190322.of.develop.116.noarch.rpm /home/bamboo/ci/bamboo/xml-data/build-dir/OPENNMS-OF-SMOKEFLAP/rpms/opennms-minion-features-default-25.0.0-0.20190322.of.develop.116.noarch.rpm /home/bamboo/ci/bamboo/xml-data/build-dir/OPENNMS-OF-SMOKEFLAP/rpms/opennms-plugin-collector-juniper-tca-25.0.0-0.20190322.of.develop.116.noarch.rpm /home/bamboo/ci/bamboo/xml-data/build-dir/OPENNMS-OF-SMOKEFLAP/rpms/opennms-plugin-collector-vtdxml-handler-25.0.0-0.20190322.of.develop.116.noarch.rpm /home/bamboo/ci/bamboo/xml-data/build-dir/OPENNMS-OF-SMOKEFLAP/rpms/opennms-plugin-northbounder-jms-25.0.0-0.20190322.of.develop.116.noarch.rpm /home/bamboo/ci/bamboo/xml-data/build-dir/OPENNMS-OF-SMOKEFLAP/rpms/opennms-plugin-protocol-cifs-25.0.0-0.20190322.of.develop.116.noarch.rpm /home/bamboo/ci/bamboo/xml-data/build-dir/OPENNMS-OF-SMOKEFLAP/rpms/opennms-plugin-protocol-nsclient-25.0.0-0.20190322.of.develop.116.noarch.rpm /home/bamboo/ci/bamboo/xml-data/build-dir/OPENNMS-OF-SMOKEFLAP/rpms/opennms-plugin-protocol-radius-25.0.0-0.20190322.of.develop.116.noarch.rpm /home/bamboo/ci/bamboo/xml-data/build-dir/OPENNMS-OF-SMOKEFLAP/rpms/opennms-plugin-protocol-xmp-25.0.0-0.20190322.of.develop.116.noarch.rpm /home/bamboo/ci/bamboo/xml-data/build-dir/OPENNMS-OF-SMOKEFLAP/rpms/opennms-plugin-provisioning-dns-25.0.0-0.20190322.of.develop.116.noarch.rpm /home/bamboo/ci/bamboo/xml-data/build-dir/OPENNMS-OF-SMOKEFLAP/rpms/opennms-plugin-provisioning-rancid-25.0.0-0.20190322.of.develop.116.noarch.rpm /home/bamboo/ci/bamboo/xml-data/build-dir/OPENNMS-OF-SMOKEFLAP/rpms/opennms-plugin-provisioning-reverse-dns-25.0.0-0.20190322.of.develop.116.noarch.rpm /home/bamboo/ci/bamboo/xml-data/build-dir/OPENNMS-OF-SMOKEFLAP/rpms/opennms-plugin-provisioning-snmp-asset-25.0.0-0.20190322.of.develop.116.noarch.rpm /home/bamboo/ci/bamboo/xml-data/build-dir/OPENNMS-OF-SMOKEFLAP/rpms/opennms-plugin-provisioning-snmp-hardware-inventory-25.0.0-0.20190322.of.develop.116.noarch.rpm /home/bamboo/ci/bamboo/xml-data/build-dir/OPENNMS-OF-SMOKEFLAP/rpms/opennms-plugin-provisioning-wsman-asset-25.0.0-0.20190322.of.develop.116.noarch.rpm /home/bamboo/ci/bamboo/xml-data/build-dir/OPENNMS-OF-SMOKEFLAP/rpms/opennms-plugins-25.0.0-0.20190322.of.develop.116.noarch.rpm /home/bamboo/ci/bamboo/xml-data/build-dir/OPENNMS-OF-SMOKEFLAP/rpms/opennms-plugin-ticketer-centric-25.0.0-0.20190322.of.develop.116.noarch.rpm /home/bamboo/ci/bamboo/xml-data/build-dir/OPENNMS-OF-SMOKEFLAP/rpms/opennms-plugin-ticketer-jira-25.0.0-0.20190322.of.develop.116.noarch.rpm /home/bamboo/ci/bamboo/xml-data/build-dir/OPENNMS-OF-SMOKEFLAP/rpms/opennms-plugin-ticketer-otrs-25.0.0-0.20190322.of.develop.116.noarch.rpm /home/bamboo/ci/bamboo/xml-data/build-dir/OPENNMS-OF-SMOKEFLAP/rpms/opennms-plugin-ticketer-rt-25.0.0-0.20190322.of.develop.116.noarch.rpm /home/bamboo/ci/bamboo/xml-data/build-dir/OPENNMS-OF-SMOKEFLAP/rpms/opennms-remote-poller-25.0.0-0.20190322.of.develop.116.noarch.rpm /home/bamboo/ci/bamboo/xml-data/build-dir/OPENNMS-OF-SMOKEFLAP/rpms/opennms-sentinel-25.0.0-0.20190322.of.develop.116.noarch.rpm /home/bamboo/ci/bamboo/xml-data/build-dir/OPENNMS-OF-SMOKEFLAP/rpms/opennms-source-25.0.0-0.20190322.of.develop.116.noarch.rpm /home/bamboo/ci/bamboo/xml-data/build-dir/OPENNMS-OF-SMOKEFLAP/rpms/opennms-webapp-hawtio-25.0.0-0.20190322.of.develop.116.noarch.rpm /home/bamboo/ci/bamboo/xml-data/build-dir/OPENNMS-OF-SMOKEFLAP/rpms/opennms-webapp-jetty-25.0.0-0.20190322.of.develop.116.noarch.rpm /home/bamboo/ci/bamboo/xml-data/build-dir/OPENNMS-OF-SMOKEFLAP/rpms/opennms-webapp-remoting-25.0.0-0.20190322.of.develop.116.noarch.rpm /home/bamboo/ci/bamboo/xml-data/build-dir/OPENNMS-OF-SMOKEFLAP/opennms-system-test-api/docker/opennms/rpms/
+ mv /home/bamboo/ci/bamboo/xml-data/build-dir/OPENNMS-OF-SMOKEFLAP/opennms-system-test-api/docker/opennms/rpms/opennms-minion-25.0.0-0.20190322.of.develop.116.noarch.rpm /home/bamboo/ci/bamboo/xml-data/build-dir/OPENNMS-OF-SMOKEFLAP/opennms-system-test-api/docker/opennms/rpms/opennms-minion-container-25.0.0-0.20190322.of.develop.116.noarch.rpm /home/bamboo/ci/bamboo/xml-data/build-dir/OPENNMS-OF-SMOKEFLAP/opennms-system-test-api/docker/opennms/rpms/opennms-minion-features-core-25.0.0-0.20190322.of.develop.116.noarch.rpm /home/bamboo/ci/bamboo/xml-data/build-dir/OPENNMS-OF-SMOKEFLAP/opennms-system-test-api/docker/opennms/rpms/opennms-minion-features-default-25.0.0-0.20190322.of.develop.116.noarch.rpm /home/bamboo/ci/bamboo/xml-data/build-dir/OPENNMS-OF-SMOKEFLAP/opennms-system-test-api/docker/minion/rpms/
+ mv /home/bamboo/ci/bamboo/xml-data/build-dir/OPENNMS-OF-SMOKEFLAP/opennms-system-test-api/docker/opennms/rpms/opennms-sentinel-25.0.0-0.20190322.of.develop.116.noarch.rpm /home/bamboo/ci/bamboo/xml-data/build-dir/OPENNMS-OF-SMOKEFLAP/opennms-system-test-api/docker/sentinel/rpms/
+ cd /home/bamboo/ci/bamboo/xml-data/build-dir/OPENNMS-OF-SMOKEFLAP/opennms-system-test-api/docker
+ ./build-docker-images.sh
+ cd /home/bamboo/ci/bamboo/xml-data/build-dir/OPENNMS-OF-SMOKEFLAP
+ EXTRA_ARGS=()
+ set +u
+ '[' -n 172.20.1.213 ']'
+ EXTRA_ARGS+=("-Dorg.opennms.advertised-host-address=${bamboo_capability_host_address}")
+ set -u
+ RERUNS=2
+ '[' true = true ']'
+ RERUNS=0
+ EXTRA_ARGS+=('-DrunFlappers=true')
+ cd /home/bamboo/ci/bamboo/xml-data/build-dir/OPENNMS-OF-SMOKEFLAP/opennms-source
+ ./compile.pl -Dmaven.test.skip.exec=true -Dsmoke=true --projects org.opennms:smoke-test --also-make install
+ cd smoke-test
+ xvfb-run --wait=20 '--server-args=-screen 0 1920x1080x24' --server-num=80 --auto-servernum --listen-tcp ../compile.pl -Dsurefire.rerunFailingTestsCount=0 -Dfailsafe.rerunFailingTestsCount=0 -Dorg.opennms.smoketest.logLevel=INFO -Dtest.fork.count=1 -Dorg.opennms.smoketest.docker=true -Dorg.opennms.advertised-host-address=172.20.1.213 -DrunFlappers=true -Dsmoke=true -t
+ exit 1
No Match for argument: opennms-upgrade
No Match for argument: meridian-upgrade
No Match for argument: opennms-docs
No Match for argument: meridian-docs
No Match for argument: opennms-core
No Match for argument: meridian-core
No Match for argument: opennms-plugin-ticketer-centric
No Match for argument: meridian-plugin-ticketer-centric
No Match for argument: opennms-source
No Match for argument: meridian-source
No Match for argument: opennms-remote-poller
No Match for argument: meridian-remote-poller
No Match for argument: opennms-minion-core
No Match for argument: meridian-minion-core
No Match for argument: opennms-minion-features
No Match for argument: meridian-minion-features
No Match for argument: opennms-minion-container
No Match for argument: meridian-minion-container