Build #109

Build: #109 failed

Job: Smoke Test (Flapping) failed

Verify no vertices found text is shown: Test case result

The below summarizes the result of the test "Verify no vertices found text is shown" in build 109 of OpenNMS - Flapping - Smoke Test (Flapping). View test case history
Description
Verify no vertices found text is shown
Test class
org.opennms.smoketest.TopologyIT
Method
verifyNoVerticesFoundTextIsShown
Duration
36 secs
Status
Failed (New Failure)

Error Log

org.openqa.selenium.NoSuchElementException: Unable to locate element: {"method":"xpath","selector":"//*/table[@class='search-token-field']//div[@class='search-token-label' and contains(text(),'Node-3')]"}
Command duration or timeout: 1.09 seconds
For documentation on this error, please visit: http://seleniumhq.org/exceptions/no_such_element.html
Build info: version: '2.53.1', revision: 'a36b8b1cd5757287168e54b817830adce9b0158d', time: '2016-06-30 19:26:09'
System info: host: 'cmu.internal.opennms.com', ip: '172.20.1.203', os.name: 'Linux', os.arch: 'amd64', os.version: '4.18.0-16-generic', java.version: '1.8.0_201'
Driver info: org.openqa.selenium.firefox.FirefoxDriver
Capabilities [{applicationCacheEnabled=true, rotatable=false, handlesAlerts=true, databaseEnabled=true, version=45.0.2, platform=LINUX, nativeEvents=false, acceptSslCerts=true, webStorageEnabled=true, locationContextEnabled=true, browserName=firefox, takesScreenshot=true, javascriptEnabled=true, cssSelectorsEnabled=true}]
Session ID: 06bffff3-60b4-4e5d-a68b-a24d8dcfa304
*** Element info: {Using=xpath, value=//*/table[@class='search-token-field']//div[@class='search-token-label' and contains(text(),'Node-3')]}
org.openqa.selenium.NoSuchElementException: 
Unable to locate element: {"method":"xpath","selector":"//*/table[@class='search-token-field']//div[@class='search-token-label' and contains(text(),'Node-3')]"}
Command duration or timeout: 1.09 seconds
For documentation on this error, please visit: http://seleniumhq.org/exceptions/no_such_element.html
Build info: version: '2.53.1', revision: 'a36b8b1cd5757287168e54b817830adce9b0158d', time: '2016-06-30 19:26:09'
System info: host: 'cmu.internal.opennms.com', ip: '172.20.1.203', os.name: 'Linux', os.arch: 'amd64', os.version: '4.18.0-16-generic', java.version: '1.8.0_201'
Driver info: org.openqa.selenium.firefox.FirefoxDriver
Capabilities [{applicationCacheEnabled=true, rotatable=false, handlesAlerts=true, databaseEnabled=true, version=45.0.2, platform=LINUX, nativeEvents=false, acceptSslCerts=true, webStorageEnabled=true, locationContextEnabled=true, browserName=firefox, takesScreenshot=true, javascriptEnabled=true, cssSelectorsEnabled=true}]
Session ID: 06bffff3-60b4-4e5d-a68b-a24d8dcfa304
*** Element info: {Using=xpath, value=//*/table[@class='search-token-field']//div[@class='search-token-label' and contains(text(),'Node-3')]}
	at org.opennms.smoketest.TopologyIT.setUp(TopologyIT.java:892)
Caused by: org.openqa.selenium.NoSuchElementException: 
Unable to locate element: {"method":"xpath","selector":"//*/table[@class='search-token-field']//div[@class='search-token-label' and contains(text(),'Node-3')]"}
For documentation on this error, please visit: http://seleniumhq.org/exceptions/no_such_element.html
Build info: version: '2.53.1', revision: 'a36b8b1cd5757287168e54b817830adce9b0158d', time: '2016-06-30 19:26:09'
System info: host: 'cmu.internal.opennms.com', ip: '172.20.1.203', os.name: 'Linux', os.arch: 'amd64', os.version: '4.18.0-16-generic', java.version: '1.8.0_201'
Driver info: driver.version: unknown