Build #162

Build: #162 failed

Job: Integration Test (Flapping) failed

Test results

  • 2,173 tests in total
  • 2 tests failed
  • 1 test was fixed
  • 42 tests were quarantined / skipped
  • 15 minutes taken in total.

Build 162 has the following 2 errors:There were no new test failures since the previous build.

Existing test failures 2
Status Test Failing since Duration
java.lang.Exception: ActiveMQ broker was not started or stopped unexpectedly. Error: org.apache.activemq.broker.BrokerStoppedException: Stop invoked
	at org.opennms.core.test.activemq.ActiveMQBroker.before(ActiveMQBroker.java:56)
	at org.junit.rules.ExternalResource$1.evaluate(ExternalResource.java:46)
	at org.junit.rules.RunRules.evaluate(RunRules.java:20)
	at org.junit.runners.ParentRunner.run(ParentRunner.java:363)
	at org.springframework.test.context.junit4.SpringJUnit4ClassRunner.run(SpringJUnit4ClassRunner.java:193)
	at org.apache.maven.surefire.junit4.JUnit4Provider.execute(JUnit4Provider.java:275)
	at org.apache.maven.surefire.junit4.JUnit4Provider.executeWithRerun(JUnit4Provider.java:183)
(5 more lines...)
java.lang.NullPointerException: null
	at org.opennms.core.ipc.sink.camel.itests.HeartbeatSinkPerfIT.setUp(HeartbeatSinkPerfIT.java:167)