Build #159

Build: #159 failed

Job: Integration Test (Flapping) failed

Test results

  • 2,174 tests in total
  • 4 tests failed
  • 4 failures are new
  • 42 tests were quarantined / skipped
  • 18 minutes taken in total.

Build 159 has the following 4 errors: 4 new failure(s) occurred since the previous build.

New test failures 4
Status Test Duration
Collapse Failed HeartbeatSinkBlueprintIT canProduceAndConsumerMessages History
2 secs
java.lang.NullPointerException: null
	at org.opennms.core.ipc.sink.camel.itests.HeartbeatSinkBlueprintIT.canProduceAndConsumerMessages(HeartbeatSinkBlueprintIT.java:148)
Collapse Failed HeartbeatSinkBlueprintIT org.opennms.core.ipc.sink.camel.itests.HeartbeatSinkBlueprintIT History
8 secs
java.lang.Exception: ActiveMQ broker was not started or stopped unexpectedly. Error: org.apache.activemq.broker.BrokerStoppedException: Stop invoked
	at org.opennms.core.test.activemq.ActiveMQBroker.before(ActiveMQBroker.java:56)
	at org.junit.rules.ExternalResource$1.evaluate(ExternalResource.java:46)
	at org.junit.rules.RunRules.evaluate(RunRules.java:20)
	at org.junit.runners.ParentRunner.run(ParentRunner.java:363)
	at org.springframework.test.context.junit4.SpringJUnit4ClassRunner.run(SpringJUnit4ClassRunner.java:193)
	at org.apache.maven.surefire.junit4.JUnit4Provider.execute(JUnit4Provider.java:275)
	at org.apache.maven.surefire.junit4.JUnit4Provider.executeWithRerun(JUnit4Provider.java:183)
(5 more lines...)
Collapse Failed SinkBlueprintMessageFailureIT doesntLogMessageBody History
3 secs
java.lang.AssertionError: null
	at org.junit.Assert.fail(Assert.java:86)
	at org.junit.Assert.assertTrue(Assert.java:41)
	at org.junit.Assert.assertNotNull(Assert.java:712)
	at org.junit.Assert.assertNotNull(Assert.java:722)
	at org.opennms.core.ipc.sink.camel.itests.SinkBlueprintMessageFailureIT.doesntLogMessageBody(SinkBlueprintMessageFailureIT.java:141)
Collapse Failed SinkBlueprintMessageFailureIT org.opennms.core.ipc.sink.camel.itests.SinkBlueprintMessageFailureIT History
3 secs
java.lang.Exception: ActiveMQ broker was not started or stopped unexpectedly. Error: org.apache.activemq.broker.BrokerStoppedException: Stop invoked
	at org.opennms.core.test.activemq.ActiveMQBroker.before(ActiveMQBroker.java:56)
	at org.junit.rules.ExternalResource$1.evaluate(ExternalResource.java:46)
	at org.junit.rules.RunRules.evaluate(RunRules.java:20)
	at org.junit.runners.ParentRunner.run(ParentRunner.java:363)
	at org.springframework.test.context.junit4.SpringJUnit4ClassRunner.run(SpringJUnit4ClassRunner.java:193)
	at org.apache.maven.surefire.junit4.JUnit4Provider.execute(JUnit4Provider.java:275)
	at org.apache.maven.surefire.junit4.JUnit4Provider.executeWithRerun(JUnit4Provider.java:183)
(5 more lines...)