Build #151

Build: #151 failed

Job: Integration Test (Flapping) failed

Job result summary

Completed
Duration
38 minutes
Revisions
OpenNMS (develop branch)
4dbe62b175bd968627f9e29d570605a5069814f3 4dbe62b175bd968627f9e29d570605a5069814f3
OpenNMS-Repo
0c9ce68d02c95a7c36453966d95cf9358743e72e 0c9ce68d02c95a7c36453966d95cf9358743e72e
OpenNMS Bamboo Utils
f39e85cfabf3e3509977d1fb9456f80e89810aff f39e85cfabf3e3509977d1fb9456f80e89810aff
Total tests
2678
Failing since
#80 (Code changes detected – )

Tests

  • 2,678 tests in total
  • 4 tests failed
  • 80 tests were quarantined / skipped
  • 21 minutes taken in total.
Existing test failures 4
Status Test Failing since Duration
java.lang.IllegalStateException: Failed to load ApplicationContext
	at org.springframework.test.context.cache.DefaultCacheAwareContextLoaderDelegate.loadContext(DefaultCacheAwareContextLoaderDelegate.java:124)
	at org.springframework.test.context.support.DefaultTestContext.getApplicationContext(DefaultTestContext.java:83)
	at org.springframework.test.context.support.DependencyInjectionTestExecutionListener.injectDependencies(DependencyInjectionTestExecutionListener.java:117)
	at org.springframework.test.context.support.DependencyInjectionTestExecutionListener.prepareTestInstance(DependencyInjectionTestExecutionListener.java:83)
	at org.springframework.test.context.TestContextManager.prepareTestInstance(TestContextManager.java:228)
	at org.springframework.test.context.junit4.SpringJUnit4ClassRunner.createTest(SpringJUnit4ClassRunner.java:230)
	at org.springframework.test.context.junit4.SpringJUnit4ClassRunner$1.runReflectiveCall(SpringJUnit4ClassRunner.java:289)
(171 more lines...)
java.lang.IllegalStateException: Failed to load ApplicationContext
	at org.springframework.test.context.cache.DefaultCacheAwareContextLoaderDelegate.loadContext(DefaultCacheAwareContextLoaderDelegate.java:124)
	at org.springframework.test.context.support.DefaultTestContext.getApplicationContext(DefaultTestContext.java:83)
	at org.springframework.test.context.support.DependencyInjectionTestExecutionListener.injectDependencies(DependencyInjectionTestExecutionListener.java:117)
	at org.springframework.test.context.support.DependencyInjectionTestExecutionListener.prepareTestInstance(DependencyInjectionTestExecutionListener.java:83)
	at org.springframework.test.context.TestContextManager.prepareTestInstance(TestContextManager.java:228)
	at org.springframework.test.context.junit4.SpringJUnit4ClassRunner.createTest(SpringJUnit4ClassRunner.java:230)
	at org.springframework.test.context.junit4.SpringJUnit4ClassRunner$1.runReflectiveCall(SpringJUnit4ClassRunner.java:289)
(171 more lines...)
java.lang.IllegalStateException: Failed to load ApplicationContext
	at org.springframework.test.context.cache.DefaultCacheAwareContextLoaderDelegate.loadContext(DefaultCacheAwareContextLoaderDelegate.java:124)
	at org.springframework.test.context.support.DefaultTestContext.getApplicationContext(DefaultTestContext.java:83)
	at org.springframework.test.context.support.DependencyInjectionTestExecutionListener.injectDependencies(DependencyInjectionTestExecutionListener.java:117)
	at org.springframework.test.context.support.DependencyInjectionTestExecutionListener.prepareTestInstance(DependencyInjectionTestExecutionListener.java:83)
	at org.springframework.test.context.TestContextManager.prepareTestInstance(TestContextManager.java:228)
	at org.springframework.test.context.junit4.SpringJUnit4ClassRunner.createTest(SpringJUnit4ClassRunner.java:230)
	at org.springframework.test.context.junit4.SpringJUnit4ClassRunner$1.runReflectiveCall(SpringJUnit4ClassRunner.java:289)
(171 more lines...)
java.lang.Exception: ActiveMQ broker was not started or stopped unexpectedly. Error: org.apache.activemq.broker.BrokerStoppedException: Stop invoked
	at org.opennms.core.test.activemq.ActiveMQBroker.before(ActiveMQBroker.java:56)
	at org.junit.rules.ExternalResource$1.evaluate(ExternalResource.java:46)
	at org.junit.rules.RunRules.evaluate(RunRules.java:20)
	at org.junit.runners.ParentRunner.run(ParentRunner.java:363)
	at org.springframework.test.context.junit4.SpringJUnit4ClassRunner.run(SpringJUnit4ClassRunner.java:193)
	at org.apache.maven.surefire.junit4.JUnit4Provider.execute(JUnit4Provider.java:275)
	at org.apache.maven.surefire.junit4.JUnit4Provider.executeWithRerun(JUnit4Provider.java:183)
(5 more lines...)

Error summary

The build generated some errors. See the full build log for more details.

No Match for argument: opennms-upgrade
No Match for argument: meridian-upgrade
No Match for argument: opennms-docs
No Match for argument: meridian-docs
No Match for argument: opennms-core
No Match for argument: meridian-core
No Match for argument: opennms-plugin-ticketer-centric
No Match for argument: meridian-plugin-ticketer-centric
No Match for argument: opennms-source
No Match for argument: meridian-source
No Match for argument: opennms-remote-poller
No Match for argument: meridian-remote-poller
No Match for argument: opennms-minion-core
No Match for argument: meridian-minion-core
No Match for argument: opennms-minion-features
No Match for argument: meridian-minion-features
No Match for argument: opennms-minion-container
No Match for argument: meridian-minion-container
Initializing MockLogger.
Initializing MockLogger.
Initializing MockLogger.
Initializing MockLogger.
Initializing MockLogger.
Initializing MockLogger.
Initializing MockLogger.
Initializing MockLogger.
Initializing MockLogger.
Initializing MockLogger.
Initializing MockLogger.
Initializing MockLogger.
Initializing MockLogger.
Initializing MockLogger.
Initializing MockLogger.
Initializing MockLogger.
Initializing MockLogger.
Initializing MockLogger.
Initializing MockLogger.
Initializing MockLogger.
Initializing MockLogger.
Initializing MockLogger.
Initializing MockLogger.
Initializing MockLogger.
Initializing MockLogger.
Initializing MockLogger.
Initializing MockLogger.
Initializing MockLogger.
Initializing MockLogger.
Initializing MockLogger.
Initializing MockLogger.
Initializing MockLogger.
Initializing MockLogger.
Initializing MockLogger.
Initializing MockLogger.
Initializing MockLogger.
Initializing MockLogger.
Initializing MockLogger.
Initializing MockLogger.
Initializing MockLogger.
Initializing MockLogger.
Initializing MockLogger.
Initializing MockLogger.
Initializing MockLogger.
Initializing MockLogger.
Initializing MockLogger.
Initializing MockLogger.
Initializing MockLogger.
Initializing MockLogger.
Initializing MockLogger.
Initializing MockLogger.
Initializing MockLogger.
Initializing MockLogger.
Initializing MockLogger.
Initializing MockLogger.
Initializing MockLogger.
Initializing MockLogger.
Initializing MockLogger.
Initializing MockLogger.
Initializing MockLogger.
Initializing MockLogger.
Initializing MockLogger.
Initializing MockLogger.
Initializing MockLogger.
Initializing MockLogger.
Initializing MockLogger.
Initializing MockLogger.
Initializing MockLogger.
Initializing MockLogger.
Initializing MockLogger.
Initializing MockLogger.
Initializing MockLogger.
Initializing MockLogger.
Initializing MockLogger.
Initializing MockLogger.
Initializing MockLogger.
Initializing MockLogger.
Initializing MockLogger.
Initializing MockLogger.
Initializing MockLogger.
Initializing MockLogger.
Initializing MockLogger.
Initializing MockLogger.
Initializing MockLogger.
Initializing MockLogger.
Initializing MockLogger.
Initializing MockLogger.
Initializing MockLogger.
Initializing MockLogger.
Initializing MockLogger.
Initializing MockLogger.
Initializing MockLogger.
Initializing MockLogger.
Initializing MockLogger.
Initializing MockLogger.
Initializing MockLogger.
Initializing MockLogger.
SLF4J: Failed to load class "org.slf4j.impl.StaticMDCBinder".
SLF4J: Defaulting to no-operation MDCAdapter implementation.
SLF4J: See http://www.slf4j.org/codes.html#no_static_mdc_binder for further details.
No Match for argument: opennms-upgrade
No Match for argument: meridian-upgrade
No Match for argument: opennms-docs
No Match for argument: meridian-docs
No Match for argument: opennms-core
No Match for argument: meridian-core
No Match for argument: opennms-plugin-ticketer-centric
No Match for argument: meridian-plugin-ticketer-centric
No Match for argument: opennms-source
No Match for argument: meridian-source
No Match for argument: opennms-remote-poller
No Match for argument: meridian-remote-poller
No Match for argument: opennms-minion-core
No Match for argument: meridian-minion-core
No Match for argument: opennms-minion-features
No Match for argument: meridian-minion-features
No Match for argument: opennms-minion-container
No Match for argument: meridian-minion-container