Build #88

Build: #88 failed Changes by 3 people

Build result summary

Details

Completed
Duration
406 minutes
Labels
None
Revisions
OpenNMS (develop branch)
299d15f82559a6b174f2510c5f43514c32391941 299d15f82559a6b174f2510c5f43514c32391941
OpenNMS Installer
da12784d9ab4ba4aacedec0283d0c04075fd6ebf da12784d9ab4ba4aacedec0283d0c04075fd6ebf
OpenNMS-Repo
088d710674109759251f42c6720d74ea80cf3f13 088d710674109759251f42c6720d74ea80cf3f13
Smoke Tests
cb1e72265cf2ce10cb4872f58120272b340a1ce1 cb1e72265cf2ce10cb4872f58120272b340a1ce1
OpenNMS Bamboo Utils
0a62053bc90f6ffcce1e17256674b2dae7b4f8a3 0a62053bc90f6ffcce1e17256674b2dae7b4f8a3
OpenNMS System Test API
2baceb98eba956ca0f62f0e2d469d9f73b7ffd02 2baceb98eba956ca0f62f0e2d469d9f73b7ffd02
Total tests
4908
Failing since
#27 (Changes by mvrueden <mvrueden@users.noreply.github.com> and Jesse White)

Responsible

Code commits

OpenNMS (develop branch)
Author Commit Message Commit date
Jesse White Jesse White 299d15f82559a6b174f2510c5f43514c32391941 299d15f82559a6b174f2510c5f43514c32391941 Merge pull request #2356 from OpenNMS/jira/NMS-10543
NMS-10543: bump PostgreSQL JDBC driver to the latest version
Jesse White Jesse White 22a7b5e007a19c60c7a935fe6462452a247f2231 22a7b5e007a19c60c7a935fe6462452a247f2231 Merge pull request #2351 from OpenNMS/jira/NMS-10518-coverage
NMS-10518: additional fixes
Jesse White Jesse White 9285a3d3bee78a3a4ae14722e5baebdd791a84c0 9285a3d3bee78a3a4ae14722e5baebdd791a84c0 Merge pull request #2355 from OpenNMS/jira/NMS-10561
NMS-10561: Fix sentinel-core feature dependency issue
Benjamin Reed Benjamin Reed 37e8233795ad6bef6d8f74d7dce0406eb04de82c 37e8233795ad6bef6d8f74d7dce0406eb04de82c NMS-10543: bump PostgreSQL JDBC driver to the latest version
Benjamin Reed Benjamin Reed fb58033c970d1fba0fd44068ef9f1f696da83e65 m fb58033c970d1fba0fd44068ef9f1f696da83e65 NMS-10518: run shell tests on !windows during the test phase

Tests

New test failures 1
Status Test View job Duration
Collapse Failed XRequestedWithRestIT verifyWWWAuthenticate History
Smoke Test (Flapping) 14 secs
java.lang.AssertionError: 1 expectation failed.
Expected header "WWW-Authenticate" was not a string containing "Basic", was "null". Headers are:
Date=Wed, 13 Feb 2019 01:22:26 GMT
X-Frame-Options=SAMEORIGIN
Content-Length=0
Server=Jetty(9.4.14.v20181114)

java.lang.AssertionError: 
(8 more lines...)
Existing test failures 22
Status Test Failing since View job Duration
java.lang.IllegalStateException: Failed to load ApplicationContext
	at org.springframework.test.context.cache.DefaultCacheAwareContextLoaderDelegate.loadContext(DefaultCacheAwareContextLoaderDelegate.java:124)
	at org.springframework.test.context.support.DefaultTestContext.getApplicationContext(DefaultTestContext.java:83)
	at org.springframework.test.context.support.DependencyInjectionTestExecutionListener.injectDependencies(DependencyInjectionTestExecutionListener.java:117)
	at org.springframework.test.context.support.DependencyInjectionTestExecutionListener.prepareTestInstance(DependencyInjectionTestExecutionListener.java:83)
	at org.springframework.test.context.TestContextManager.prepareTestInstance(TestContextManager.java:228)
	at org.springframework.test.context.junit4.SpringJUnit4ClassRunner.createTest(SpringJUnit4ClassRunner.java:230)
	at org.springframework.test.context.junit4.SpringJUnit4ClassRunner$1.runReflectiveCall(SpringJUnit4ClassRunner.java:289)
(52 more lines...)
java.lang.IllegalStateException: Failed to load ApplicationContext
Caused by: java.lang.IllegalArgumentException: Cannot load an ApplicationContext with a NULL 'contextLoader'. Consider annotating your test class with @ContextConfiguration or @ContextHierarchy.
java.lang.IllegalStateException: Failed to load ApplicationContext
Caused by: java.lang.IllegalArgumentException: Cannot load an ApplicationContext with a NULL 'contextLoader'. Consider annotating your test class with @ContextConfiguration or @ContextHierarchy.
java.lang.IllegalStateException: Failed to load ApplicationContext
Caused by: java.lang.IllegalArgumentException: Cannot load an ApplicationContext with a NULL 'contextLoader'. Consider annotating your test class with @ContextConfiguration or @ContextHierarchy.
java.lang.IllegalStateException: Failed to load ApplicationContext
Caused by: java.lang.IllegalArgumentException: Cannot load an ApplicationContext with a NULL 'contextLoader'. Consider annotating your test class with @ContextConfiguration or @ContextHierarchy.
java.lang.IllegalStateException: Failed to load ApplicationContext
Caused by: java.lang.IllegalArgumentException: Cannot load an ApplicationContext with a NULL 'contextLoader'. Consider annotating your test class with @ContextConfiguration or @ContextHierarchy.
java.lang.IllegalStateException: Failed to load ApplicationContext
Caused by: java.lang.IllegalArgumentException: Cannot load an ApplicationContext with a NULL 'contextLoader'. Consider annotating your test class with @ContextConfiguration or @ContextHierarchy.
java.lang.IllegalStateException: Failed to load ApplicationContext
Caused by: java.lang.IllegalArgumentException: Cannot load an ApplicationContext with a NULL 'contextLoader'. Consider annotating your test class with @ContextConfiguration or @ContextHierarchy.
java.lang.IllegalStateException: Failed to load ApplicationContext
Caused by: java.lang.IllegalArgumentException: Cannot load an ApplicationContext with a NULL 'contextLoader'. Consider annotating your test class with @ContextConfiguration or @ContextHierarchy.
java.lang.IllegalStateException: Failed to load ApplicationContext
Caused by: java.lang.IllegalArgumentException: Cannot load an ApplicationContext with a NULL 'contextLoader'. Consider annotating your test class with @ContextConfiguration or @ContextHierarchy.
java.lang.IllegalStateException: Failed to load ApplicationContext
Caused by: java.lang.IllegalArgumentException: Cannot load an ApplicationContext with a NULL 'contextLoader'. Consider annotating your test class with @ContextConfiguration or @ContextHierarchy.
java.lang.IllegalStateException: Failed to load ApplicationContext
Caused by: java.lang.IllegalArgumentException: Cannot load an ApplicationContext with a NULL 'contextLoader'. Consider annotating your test class with @ContextConfiguration or @ContextHierarchy.
java.lang.IllegalStateException: Failed to load ApplicationContext
Caused by: java.lang.IllegalArgumentException: Cannot load an ApplicationContext with a NULL 'contextLoader'. Consider annotating your test class with @ContextConfiguration or @ContextHierarchy.
java.lang.IllegalStateException: Failed to load ApplicationContext
Caused by: java.lang.IllegalArgumentException: Cannot load an ApplicationContext with a NULL 'contextLoader'. Consider annotating your test class with @ContextConfiguration or @ContextHierarchy.
java.lang.IllegalStateException: Failed to load ApplicationContext
Caused by: java.lang.IllegalArgumentException: Cannot load an ApplicationContext with a NULL 'contextLoader'. Consider annotating your test class with @ContextConfiguration or @ContextHierarchy.
java.lang.IllegalStateException: Failed to load ApplicationContext
Caused by: java.lang.IllegalArgumentException: Cannot load an ApplicationContext with a NULL 'contextLoader'. Consider annotating your test class with @ContextConfiguration or @ContextHierarchy.
java.lang.IllegalStateException: Failed to load ApplicationContext
Caused by: java.lang.IllegalArgumentException: Cannot load an ApplicationContext with a NULL 'contextLoader'. Consider annotating your test class with @ContextConfiguration or @ContextHierarchy.
java.lang.IllegalStateException: Failed to load ApplicationContext
Caused by: java.lang.IllegalArgumentException: Cannot load an ApplicationContext with a NULL 'contextLoader'. Consider annotating your test class with @ContextConfiguration or @ContextHierarchy.
java.lang.IllegalStateException: Failed to load ApplicationContext
Caused by: java.lang.IllegalArgumentException: Cannot load an ApplicationContext with a NULL 'contextLoader'. Consider annotating your test class with @ContextConfiguration or @ContextHierarchy.
java.lang.IllegalStateException: Failed to load ApplicationContext
Caused by: java.lang.IllegalArgumentException: Cannot load an ApplicationContext with a NULL 'contextLoader'. Consider annotating your test class with @ContextConfiguration or @ContextHierarchy.
java.lang.IllegalStateException: Failed to load ApplicationContext
Caused by: java.lang.IllegalArgumentException: Cannot load an ApplicationContext with a NULL 'contextLoader'. Consider annotating your test class with @ContextConfiguration or @ContextHierarchy.
org.openqa.selenium.TimeoutException: Timed out after 120 seconds waiting for org.opennms.smoketest.OpenNMSSeleniumTestCase$3@6eb06667
Build info: version: '2.53.1', revision: 'a36b8b1cd5757287168e54b817830adce9b0158d', time: '2016-06-30 19:26:09'
System info: host: 'bambooagent02.internal.opennms.com', ip: '172.20.1.214', os.name: 'Linux', os.arch: 'amd64', os.version: '4.15.0-45-generic', java.version: '1.8.0_201'
Driver info: org.openqa.selenium.firefox.FirefoxDriver
Capabilities [{applicationCacheEnabled=true, rotatable=false, handlesAlerts=true, databaseEnabled=true, version=45.0.2, platform=LINUX, nativeEvents=false, acceptSslCerts=true, webStorageEnabled=true, locationContextEnabled=true, browserName=firefox, takesScreenshot=true, javascriptEnabled=true, cssSelectorsEnabled=true}]
Session ID: 5909488e-b197-4ebd-a06e-617892d9f225
org.openqa.selenium.TimeoutException: 
Timed out after 120 seconds waiting for org.opennms.smoketest.OpenNMSSeleniumTestCase$3@6eb06667
(6 more lines...)
Fixed tests 2
Status Test Failing since View job Duration
Successful EditInRequisitionIT testIfDeployed History
Failing since build #86 (Changes by 3 people) Smoke Test (Flapping) 18 secs
Successful MinionHeartbeatOutageIT testHeartbeatOutages History
Failing since build #87 (Changes by Jesse White) Smoke Test (Flapping) 6 mins

Jira issues

IssueDescriptionStatus
Unknown Issue TypeNMS-10518Could not obtain issue details from Jira
Unknown Issue TypeNMS-10543Could not obtain issue details from Jira
Unknown Issue TypeNMS-10561Could not obtain issue details from Jira