Build #87

Build: #87 failed Changes by Jesse White

Test results

  • 4,908 tests in total
  • 24 tests failed
  • 1 failure is new
  • 1 test was fixed
  • 144 tests were quarantined / skipped
  • 271 minutes taken in total.
New test failures 1
Status Test View job Duration
Collapse Failed MinionHeartbeatOutageIT testHeartbeatOutages History
Smoke Test (Flapping) 9 mins
com.jayway.awaitility.core.ConditionTimeoutException: org.opennms.smoketest.utils.DaoUtils.countMatchingCallable Callable expected <1> but was <0> within 240 seconds.
	at org.opennms.smoketest.minion.MinionHeartbeatOutageIT.testHeartbeatOutages(MinionHeartbeatOutageIT.java:258)
Existing test failures 23
Status Test Failing since View job Duration
java.lang.IllegalStateException: Failed to load ApplicationContext
	at org.springframework.test.context.cache.DefaultCacheAwareContextLoaderDelegate.loadContext(DefaultCacheAwareContextLoaderDelegate.java:124)
	at org.springframework.test.context.support.DefaultTestContext.getApplicationContext(DefaultTestContext.java:83)
	at org.springframework.test.context.support.DependencyInjectionTestExecutionListener.injectDependencies(DependencyInjectionTestExecutionListener.java:117)
	at org.springframework.test.context.support.DependencyInjectionTestExecutionListener.prepareTestInstance(DependencyInjectionTestExecutionListener.java:83)
	at org.springframework.test.context.TestContextManager.prepareTestInstance(TestContextManager.java:228)
	at org.springframework.test.context.junit4.SpringJUnit4ClassRunner.createTest(SpringJUnit4ClassRunner.java:230)
	at org.springframework.test.context.junit4.SpringJUnit4ClassRunner$1.runReflectiveCall(SpringJUnit4ClassRunner.java:289)
(52 more lines...)
java.lang.IllegalStateException: Failed to load ApplicationContext
Caused by: java.lang.IllegalArgumentException: Cannot load an ApplicationContext with a NULL 'contextLoader'. Consider annotating your test class with @ContextConfiguration or @ContextHierarchy.
java.lang.IllegalStateException: Failed to load ApplicationContext
Caused by: java.lang.IllegalArgumentException: Cannot load an ApplicationContext with a NULL 'contextLoader'. Consider annotating your test class with @ContextConfiguration or @ContextHierarchy.
java.lang.IllegalStateException: Failed to load ApplicationContext
Caused by: java.lang.IllegalArgumentException: Cannot load an ApplicationContext with a NULL 'contextLoader'. Consider annotating your test class with @ContextConfiguration or @ContextHierarchy.
java.lang.IllegalStateException: Failed to load ApplicationContext
Caused by: java.lang.IllegalArgumentException: Cannot load an ApplicationContext with a NULL 'contextLoader'. Consider annotating your test class with @ContextConfiguration or @ContextHierarchy.
java.lang.IllegalStateException: Failed to load ApplicationContext
Caused by: java.lang.IllegalArgumentException: Cannot load an ApplicationContext with a NULL 'contextLoader'. Consider annotating your test class with @ContextConfiguration or @ContextHierarchy.
java.lang.IllegalStateException: Failed to load ApplicationContext
Caused by: java.lang.IllegalArgumentException: Cannot load an ApplicationContext with a NULL 'contextLoader'. Consider annotating your test class with @ContextConfiguration or @ContextHierarchy.
java.lang.IllegalStateException: Failed to load ApplicationContext
Caused by: java.lang.IllegalArgumentException: Cannot load an ApplicationContext with a NULL 'contextLoader'. Consider annotating your test class with @ContextConfiguration or @ContextHierarchy.
java.lang.IllegalStateException: Failed to load ApplicationContext
Caused by: java.lang.IllegalArgumentException: Cannot load an ApplicationContext with a NULL 'contextLoader'. Consider annotating your test class with @ContextConfiguration or @ContextHierarchy.
java.lang.IllegalStateException: Failed to load ApplicationContext
Caused by: java.lang.IllegalArgumentException: Cannot load an ApplicationContext with a NULL 'contextLoader'. Consider annotating your test class with @ContextConfiguration or @ContextHierarchy.
java.lang.IllegalStateException: Failed to load ApplicationContext
Caused by: java.lang.IllegalArgumentException: Cannot load an ApplicationContext with a NULL 'contextLoader'. Consider annotating your test class with @ContextConfiguration or @ContextHierarchy.
java.lang.IllegalStateException: Failed to load ApplicationContext
Caused by: java.lang.IllegalArgumentException: Cannot load an ApplicationContext with a NULL 'contextLoader'. Consider annotating your test class with @ContextConfiguration or @ContextHierarchy.
java.lang.IllegalStateException: Failed to load ApplicationContext
Caused by: java.lang.IllegalArgumentException: Cannot load an ApplicationContext with a NULL 'contextLoader'. Consider annotating your test class with @ContextConfiguration or @ContextHierarchy.
java.lang.IllegalStateException: Failed to load ApplicationContext
Caused by: java.lang.IllegalArgumentException: Cannot load an ApplicationContext with a NULL 'contextLoader'. Consider annotating your test class with @ContextConfiguration or @ContextHierarchy.
java.lang.IllegalStateException: Failed to load ApplicationContext
Caused by: java.lang.IllegalArgumentException: Cannot load an ApplicationContext with a NULL 'contextLoader'. Consider annotating your test class with @ContextConfiguration or @ContextHierarchy.
java.lang.IllegalStateException: Failed to load ApplicationContext
Caused by: java.lang.IllegalArgumentException: Cannot load an ApplicationContext with a NULL 'contextLoader'. Consider annotating your test class with @ContextConfiguration or @ContextHierarchy.
java.lang.IllegalStateException: Failed to load ApplicationContext
Caused by: java.lang.IllegalArgumentException: Cannot load an ApplicationContext with a NULL 'contextLoader'. Consider annotating your test class with @ContextConfiguration or @ContextHierarchy.
java.lang.IllegalStateException: Failed to load ApplicationContext
Caused by: java.lang.IllegalArgumentException: Cannot load an ApplicationContext with a NULL 'contextLoader'. Consider annotating your test class with @ContextConfiguration or @ContextHierarchy.
java.lang.IllegalStateException: Failed to load ApplicationContext
Caused by: java.lang.IllegalArgumentException: Cannot load an ApplicationContext with a NULL 'contextLoader'. Consider annotating your test class with @ContextConfiguration or @ContextHierarchy.
java.lang.IllegalStateException: Failed to load ApplicationContext
Caused by: java.lang.IllegalArgumentException: Cannot load an ApplicationContext with a NULL 'contextLoader'. Consider annotating your test class with @ContextConfiguration or @ContextHierarchy.
java.lang.IllegalStateException: Failed to load ApplicationContext
Caused by: java.lang.IllegalArgumentException: Cannot load an ApplicationContext with a NULL 'contextLoader'. Consider annotating your test class with @ContextConfiguration or @ContextHierarchy.
org.junit.ComparisonFailure: expected:<Node [my-node-1 ]at SeleniumTestGroup> but was:<Node []at SeleniumTestGroup>
	at org.opennms.smoketest.EditInRequisitionIT.testIfDeployed(EditInRequisitionIT.java:84)
org.openqa.selenium.TimeoutException: Timed out after 120 seconds waiting for org.opennms.smoketest.OpenNMSSeleniumTestCase$3@1bc1c081
Build info: version: '2.53.1', revision: 'a36b8b1cd5757287168e54b817830adce9b0158d', time: '2016-06-30 19:26:09'
System info: host: 'bambooagent05.internal.opennms.com', ip: '172.20.1.209', os.name: 'Linux', os.arch: 'amd64', os.version: '4.15.0-45-generic', java.version: '1.8.0_201'
Driver info: org.openqa.selenium.firefox.FirefoxDriver
Capabilities [{applicationCacheEnabled=true, rotatable=false, handlesAlerts=true, databaseEnabled=true, version=45.0.2, platform=LINUX, nativeEvents=false, acceptSslCerts=true, webStorageEnabled=true, locationContextEnabled=true, browserName=firefox, takesScreenshot=true, javascriptEnabled=true, cssSelectorsEnabled=true}]
Session ID: 7d4d5011-b47c-4763-a558-3010e51b79d7
org.openqa.selenium.TimeoutException: 
Timed out after 120 seconds waiting for org.opennms.smoketest.OpenNMSSeleniumTestCase$3@1bc1c081
(6 more lines...)
Fixed tests 1
Status Test Failing since View job Duration
Successful TopologyIT verifyNoVerticesFoundTextIsShown History
Failing since build #86 (Changes by 3 people) Smoke Test (Flapping) 49 secs
Skipped tests 100
Status Test Failing since View job
Skipped EchoRpcBlueprintIT org.opennms.core.rpc.aws.sqs.EchoRpcBlueprintIT History
Integration Test (Flapping)
Skipped EchoRpcIT org.opennms.core.rpc.aws.sqs.EchoRpcIT History
Integration Test (Flapping)
Skipped EchoRpcThreadIT org.opennms.core.rpc.aws.sqs.EchoRpcThreadIT History
Integration Test (Flapping)
Skipped InstallerDbIT testSetEventSourceOnUpgrade History
Integration Test (Flapping)
Skipped InstallerDbIT testOutagesIfServiceIdColumnConvertToNotNull History
Integration Test (Flapping)
Skipped InstallerDbIT testUpgradeColumnToNotNullWithDefault History
Integration Test (Flapping)
Skipped InstallerDbIT testCatchSnmpInterfaceNullNodeIdColumnOnUpgrade History
Integration Test (Flapping)
Skipped InstallerDbIT testSomethingUnknown History
Integration Test (Flapping)
Skipped InstallerDbIT testCatchIpInterfaceHasNullIpAddrValueOnUpgrade History
Integration Test (Flapping)
Skipped InstallerDbIT testIfServicesServiceIdColumnConvertToNotNull History
Integration Test (Flapping)
Skipped InstallerDbIT testOutagesServiceIdColumnConvertToNotNull History
Integration Test (Flapping)
Skipped InstallerDbIT testCatchSnmpInterfaceHasNullNodeIdValueOnUpgrade History
Integration Test (Flapping)
Skipped InstallerDbIT testSetOutageIdOnUpgrade History
Integration Test (Flapping)
Skipped InstallerDbIT testOutagesNodeIdColumnConvertToNotNull History
Integration Test (Flapping)
Skipped InstallerDbIT testSetUsersNotifiedIdOnUpgrade History
Integration Test (Flapping)
Skipped InstallerDbIT testSnmpInterfaceNodeIdColumnConvertToNotNull History
Integration Test (Flapping)
Skipped InstallerDbIT testCatchIpInterfaceNullIpAddrColumnOnUpgrade History
Integration Test (Flapping)
Skipped InstallerDbIT testOutagesForeignKeyIfServiceIdOnUpgrade History
Integration Test (Flapping)
Skipped InstallerDbIT testUpgradeRevision3952ToCurrentWithData History
Integration Test (Flapping)
Skipped InstallerDbIT testIfServicesNodeIdColumnConvertToNotNull History
Integration Test (Flapping)
Skipped InstallerDbIT testIfServicesIpAddrColumnConvertToNotNull History
Integration Test (Flapping)
Skipped InstallerDbIT testIfServicesForeignKeyIpInterfaceIdOnUpgrade History
Integration Test (Flapping)
Skipped InstallerDbIT testSetSnmpInterfaceIdOnUpgrade History
Integration Test (Flapping)
Skipped InstallerDbIT testSnmpInterfaceSnmpIfIndexColumnConvertToNotNull History
Integration Test (Flapping)
Skipped InstallerDbIT testBug1574 History
Integration Test (Flapping)
Skipped InstallerDbIT testIpInterfaceNodeIdColumnConvertToNotNull History
Integration Test (Flapping)
Skipped InstallerDbIT testUpgradeRevision3952ToCurrent History
Integration Test (Flapping)
Skipped InstallerDbIT testAssetsIdOnUpgrade History
Integration Test (Flapping)
Skipped InstallerDbIT testIpInterfaceForeignKeySnmpInterfaceIdOnUpgrade History
Integration Test (Flapping)
Skipped TemporaryDatabaseExecutionListenerNoClassAnnotationIT org.opennms.core.test.db.TemporaryDatabaseExecutionListenerNoClassAnnotationIT History
Integration Test (Flapping)
Skipped GenericURLStreamHandlerTest testFailToCreateURLStreamHandler History
Integration Test (Flapping)
Skipped DefaultGlobalReportRepositoryTest getRepositoryListTest History
Integration Test (Flapping)
Skipped DefaultGlobalReportRepositoryTest addReportRepositoryTest History
Integration Test (Flapping)
Skipped DefaultGlobalReportRepositoryTest getReportsTest History
Integration Test (Flapping)
Skipped DefaultGlobalReportRepositoryTest getRepositoryByIdTest History
Integration Test (Flapping)
Skipped DefaultGlobalReportRepositoryTest getRemplateStreamTest History
Integration Test (Flapping)
Skipped DefaultGlobalReportRepositoryTest getReportServiceTest History
Integration Test (Flapping)
Skipped DefaultRemoteRepositoryTest org.opennms.features.reporting.repository.remote.DefaultRemoteRepositoryTest History
Integration Test (Flapping)
Skipped OpenlayersWidgetCompontentTest testGeolocation History
Integration Test (Flapping)
Skipped JavaMailerTest testJavaMailerWithEmptySubject History
Integration Test (Flapping)
Skipped JavaMailerTest testJavaMailerWithDefaults History
Integration Test (Flapping)
Skipped JavaMailerTest testJavaMailerWithEmptyFrom History
Integration Test (Flapping)
Skipped JavaMailerTest testJavaMailerWithNullFrom History
Integration Test (Flapping)
Skipped JavaMailerTest testJavaMailerWithNullSubject History
Integration Test (Flapping)
Skipped JavaMailerTest testJavaMailerWithNullTo History
Integration Test (Flapping)
Skipped JavaMailerTest testJavaMailerWithEmptyTo History
Integration Test (Flapping)
Skipped JavaMailerTest testJavaMailerWithNullMessageText History
Integration Test (Flapping)
Skipped JavaMailerTest testJavaMailerWithEmptyMessageText History
Integration Test (Flapping)
Skipped JavaReadMailerTest testReadMessagesWithSearchTerm History
Integration Test (Flapping)
Skipped JavaReadMailerTest testGetText History
Integration Test (Flapping)
Skipped NativeSocketTest org.opennms.jicmp.jna.NativeSocketTest History
Integration Test (Flapping)
Skipped PingThreadIT org.opennms.jicmp.standalone.PingThreadIT History
Integration Test (Flapping)
Skipped DroolsAlarmContextIT canEscalateAlarm History
Integration Test (Flapping)
Skipped EventConfDataTest testV1EnterpriseIdAndGenericAndSpecificAndMatchWithVarbindsAndTC History
Integration Test (Flapping)
Skipped AlarmDaoIT testWithoutDistPoller History
Integration Test (Flapping)
Skipped AuthorizationIT testGetCategoriesWithAuthorizedGroups History
Integration Test (Flapping)
Skipped DefaultDataCollectionConfigDaoIT testLoadTimeOfDao History
Integration Test (Flapping)
Skipped JaxbUtilsTest testValidationMemoryLeak History
Integration Test (Flapping)
Skipped MonitoredServiceDaoIT testCriteriaBuilderWithApplicationAlias History
Integration Test (Flapping)
Skipped NodeDaoIT testCriteriaBuilderWithCategoryAlias History
Integration Test (Flapping)
Skipped MemoryLeakIT testMemory History
Integration Test (Flapping)
Skipped JnaPingIT testSinglePingFailureIPv6 History
Integration Test (Flapping)
Skipped JnaPingIT testSinglePingIPv6 History
Integration Test (Flapping)
Skipped JnaPingIT testSinglePingIPv4 History
Integration Test (Flapping)
Skipped JnaPingIT testParallelPingIPv6 History
Integration Test (Flapping)
Skipped JnaPingIT testParallelPingIPv4 History
Integration Test (Flapping)
Skipped JnaPingIT testPingCallbackTimeoutIPv4 History
Integration Test (Flapping)
Skipped JnaPingIT testSinglePingFailureIPv4 History
Integration Test (Flapping)
Skipped JnaPingIT testParallelPingFailureIPv4 History
Integration Test (Flapping)
Skipped JnaPingIT testParallelPingFailureIPv6 History
Integration Test (Flapping)
Skipped JnaPingIT testPingCallbackTimeoutIPv6 History
Integration Test (Flapping)
Skipped Jni6PingIT testSinglePingJni History
Integration Test (Flapping)
Skipped Jni6PingIT testParallelPingJni History
Integration Test (Flapping)
Skipped Jni6PingIT testSinglePingFailureJni History
Integration Test (Flapping)
Skipped Jni6PingIT testPingCallbackTimeoutJni History
Integration Test (Flapping)
Skipped Jni6PingIT testParallelPingFailureJni History
Integration Test (Flapping)
Skipped JniPingIT testSinglePingFailureJni History
Integration Test (Flapping)
Skipped JniPingIT testPingCallbackTimeoutJni History
Integration Test (Flapping)
Skipped JniPingIT testSinglePingJni History
Integration Test (Flapping)
Skipped JniPingIT testParallelPingFailureJni History
Integration Test (Flapping)
Skipped JniPingIT testParallelPingJni History
Integration Test (Flapping)
Skipped LocationAwarePingSweepClientIT canPingViaRemoteLocation History
Integration Test (Flapping)
Skipped LocationAwarePingSweepClientIT canPingViaLocalhost History
Integration Test (Flapping)
Skipped MicroblogClientTest testOAuthRegistration History
Integration Test (Flapping)
Skipped MicroblogDMNotificationStrategyTest postNotice History
Integration Test (Flapping)
Skipped MicroblogNotificationStrategyIT postNotice History
Integration Test (Flapping)
Skipped MicroblogReplyNotificationStrategyTest postNotice History
Integration Test (Flapping)
Skipped NotifdIT testNewSuspect History
Integration Test (Flapping)
Skipped NotificationsITCase org.opennms.netmgt.notifd.NotificationsITCase History
Integration Test (Flapping)
Skipped XMPPNotificationTest testGroupNotification History
Integration Test (Flapping)
Skipped XMPPNotificationTest testNotification History
Integration Test (Flapping)
Skipped HttpMonitorIT testTimeout History
Integration Test (Flapping)
Skipped MailTransportMonitorTest testEndToEnd History
Integration Test (Flapping)
Skipped MailTransportMonitorTest readOnlyTest History
Integration Test (Flapping)
Skipped PageSequenceMonitorIT testHttpsWithHostValidation History
Integration Test (Flapping)
Skipped PageSequenceMonitorIT testVirtualHostBadBehaviorForWordpressPlugin History
Integration Test (Flapping)
Skipped PageSequenceMonitorIT testHttps History
Integration Test (Flapping)
Skipped PageSequenceMonitorIT testHttpsWithoutHostValidation History
Integration Test (Flapping)
Skipped PageSequenceMonitorOpenNMSTest testOpenNMSUserInterface History
Integration Test (Flapping)
Skipped SSLCertMonitorIT testInternetWebsite History
Integration Test (Flapping)