Build #85

Build result summary

Details

Completed
Duration
1073 minutes
Labels
None
Revisions
OpenNMS (develop branch)
007cb0085f1ea9a11a4db07b005119e50bd95f1f 007cb0085f1ea9a11a4db07b005119e50bd95f1f
OpenNMS Installer
da12784d9ab4ba4aacedec0283d0c04075fd6ebf da12784d9ab4ba4aacedec0283d0c04075fd6ebf
OpenNMS-Repo
088d710674109759251f42c6720d74ea80cf3f13 088d710674109759251f42c6720d74ea80cf3f13
Smoke Tests
cb1e72265cf2ce10cb4872f58120272b340a1ce1 cb1e72265cf2ce10cb4872f58120272b340a1ce1
OpenNMS Bamboo Utils
a6d144f81c2df6f267b94e79328a0c8497980837 a6d144f81c2df6f267b94e79328a0c8497980837
OpenNMS System Test API
2baceb98eba956ca0f62f0e2d469d9f73b7ffd02 2baceb98eba956ca0f62f0e2d469d9f73b7ffd02
Total tests
4905
Failing since
#27 (Changes by mvrueden <mvrueden@users.noreply.github.com> and Jesse White)

Responsible

Code commits

OpenNMS (develop branch)
Author Commit Message Commit date
Jesse White Jesse White 007cb0085f1ea9a11a4db07b005119e50bd95f1f 007cb0085f1ea9a11a4db07b005119e50bd95f1f Merge pull request #2337 from OpenNMS/features/alarms-in-es
HZN-1420: Add support for indexing alarms in Elasticsearch.
Patrick Schweizer <patrick@schweizer-ing.com> Patrick Schweizer <patrick@schweizer-ing.com> e106c161ff158c7b07ec869cc44222fa2e172943 e106c161ff158c7b07ec869cc44222fa2e172943 HZN-1469: Leverage new topology generator to test the LinkdTopologyProvider (#2339)
* HZN-1469 add IT test to generate topology and load it through TopologyEntityDaoHibernate > TopologyEntityCacheImpl > LinkdTopologyProvider.
         small improvements on the TopologyGenerator
         small code cleanup in AbstractTopologyProvider

* HZN-1469 add test to LinkdTopologyProvider to verify that nodes are connected with the right nodes.
         bug fiy in EntityCache

* HZN-1469 improbved comments
Jesse White Jesse White f78a959d23f8c7ff3807195b064899528adaf7fb m f78a959d23f8c7ff3807195b064899528adaf7fb HZN-1420: Update the AlarmHistoryRepository to use optionals.
Jesse White Jesse White 1425d09886dfb17a659ca660309113d9b47357e5 m 1425d09886dfb17a659ca660309113d9b47357e5 HZN-1420: Documentation updates.
Jesse White Jesse White cb219056aaacc6cefdb791e8cfcf93d8d0912d59 m cb219056aaacc6cefdb791e8cfcf93d8d0912d59 HZN-1420: Review fixes.

Tests

New test failures 4
Status Test View job Duration
Collapse Failed MinionHeartbeatOutageIT testHeartbeatOutages History
Smoke Test (Flapping) 9 mins
com.jayway.awaitility.core.ConditionTimeoutException: org.opennms.smoketest.utils.DaoUtils.countMatchingCallable Callable expected <1> but was <0> within 240 seconds.
	at org.opennms.smoketest.minion.MinionHeartbeatOutageIT.testHeartbeatOutages(MinionHeartbeatOutageIT.java:258)
Collapse Failed OpsBoardAdminPageIT canCreateAndUseDeepLink History
Smoke Test (Flapping) 2 mins
org.openqa.selenium.TimeoutException: Timed out after 120 seconds waiting for org.opennms.smoketest.OpenNMSSeleniumTestCase$3@48b73b02
Build info: version: '2.53.1', revision: 'a36b8b1cd5757287168e54b817830adce9b0158d', time: '2016-06-30 19:26:09'
System info: host: 'bambooagent01.internal.opennms.com', ip: '172.20.1.213', os.name: 'Linux', os.arch: 'amd64', os.version: '4.15.0-45-generic', java.version: '1.8.0_201'
Driver info: org.openqa.selenium.firefox.FirefoxDriver
Capabilities [{applicationCacheEnabled=true, rotatable=false, handlesAlerts=true, databaseEnabled=true, version=45.0.2, platform=LINUX, nativeEvents=false, acceptSslCerts=true, webStorageEnabled=true, locationContextEnabled=true, browserName=firefox, takesScreenshot=true, javascriptEnabled=true, cssSelectorsEnabled=true}]
Session ID: 0c620498-37e7-482a-b50a-71069a95650b
org.openqa.selenium.TimeoutException: 
Timed out after 120 seconds waiting for org.opennms.smoketest.OpenNMSSeleniumTestCase$3@48b73b02
(6 more lines...)
Collapse Failed XRequestedWithRestIT verifyWWWAuthenticate History
Smoke Test (Flapping) 18 secs
java.lang.AssertionError: 1 expectation failed.
Expected header "WWW-Authenticate" was not a string containing "Basic", was "null". Headers are:
Date=Fri, 08 Feb 2019 07:32:13 GMT
Content-Length=0
Server=Jetty(9.4.14.v20181114)

java.lang.AssertionError: 
1 expectation failed.
(6 more lines...)
Collapse Failed SFlowTelemetryAdapterIT verifyAdapter History
Smoke Test (Flapping) 10 mins
com.jayway.awaitility.core.ConditionTimeoutException: Condition with lambda expression in org.opennms.smoketest.utils.KarafShell was not fulfilled within 5 minutes.
Existing test failures 21
Status Test Failing since View job Duration
java.lang.IllegalStateException: Failed to load ApplicationContext
	at org.springframework.test.context.cache.DefaultCacheAwareContextLoaderDelegate.loadContext(DefaultCacheAwareContextLoaderDelegate.java:124)
	at org.springframework.test.context.support.DefaultTestContext.getApplicationContext(DefaultTestContext.java:83)
	at org.springframework.test.context.support.DependencyInjectionTestExecutionListener.injectDependencies(DependencyInjectionTestExecutionListener.java:117)
	at org.springframework.test.context.support.DependencyInjectionTestExecutionListener.prepareTestInstance(DependencyInjectionTestExecutionListener.java:83)
	at org.springframework.test.context.TestContextManager.prepareTestInstance(TestContextManager.java:228)
	at org.springframework.test.context.junit4.SpringJUnit4ClassRunner.createTest(SpringJUnit4ClassRunner.java:230)
	at org.springframework.test.context.junit4.SpringJUnit4ClassRunner$1.runReflectiveCall(SpringJUnit4ClassRunner.java:289)
(52 more lines...)
java.lang.IllegalStateException: Failed to load ApplicationContext
Caused by: java.lang.IllegalArgumentException: Cannot load an ApplicationContext with a NULL 'contextLoader'. Consider annotating your test class with @ContextConfiguration or @ContextHierarchy.
java.lang.IllegalStateException: Failed to load ApplicationContext
Caused by: java.lang.IllegalArgumentException: Cannot load an ApplicationContext with a NULL 'contextLoader'. Consider annotating your test class with @ContextConfiguration or @ContextHierarchy.
java.lang.IllegalStateException: Failed to load ApplicationContext
Caused by: java.lang.IllegalArgumentException: Cannot load an ApplicationContext with a NULL 'contextLoader'. Consider annotating your test class with @ContextConfiguration or @ContextHierarchy.
java.lang.IllegalStateException: Failed to load ApplicationContext
Caused by: java.lang.IllegalArgumentException: Cannot load an ApplicationContext with a NULL 'contextLoader'. Consider annotating your test class with @ContextConfiguration or @ContextHierarchy.
java.lang.IllegalStateException: Failed to load ApplicationContext
Caused by: java.lang.IllegalArgumentException: Cannot load an ApplicationContext with a NULL 'contextLoader'. Consider annotating your test class with @ContextConfiguration or @ContextHierarchy.
java.lang.IllegalStateException: Failed to load ApplicationContext
Caused by: java.lang.IllegalArgumentException: Cannot load an ApplicationContext with a NULL 'contextLoader'. Consider annotating your test class with @ContextConfiguration or @ContextHierarchy.
java.lang.IllegalStateException: Failed to load ApplicationContext
Caused by: java.lang.IllegalArgumentException: Cannot load an ApplicationContext with a NULL 'contextLoader'. Consider annotating your test class with @ContextConfiguration or @ContextHierarchy.
java.lang.IllegalStateException: Failed to load ApplicationContext
Caused by: java.lang.IllegalArgumentException: Cannot load an ApplicationContext with a NULL 'contextLoader'. Consider annotating your test class with @ContextConfiguration or @ContextHierarchy.
java.lang.IllegalStateException: Failed to load ApplicationContext
Caused by: java.lang.IllegalArgumentException: Cannot load an ApplicationContext with a NULL 'contextLoader'. Consider annotating your test class with @ContextConfiguration or @ContextHierarchy.
java.lang.IllegalStateException: Failed to load ApplicationContext
Caused by: java.lang.IllegalArgumentException: Cannot load an ApplicationContext with a NULL 'contextLoader'. Consider annotating your test class with @ContextConfiguration or @ContextHierarchy.
java.lang.IllegalStateException: Failed to load ApplicationContext
Caused by: java.lang.IllegalArgumentException: Cannot load an ApplicationContext with a NULL 'contextLoader'. Consider annotating your test class with @ContextConfiguration or @ContextHierarchy.
java.lang.IllegalStateException: Failed to load ApplicationContext
Caused by: java.lang.IllegalArgumentException: Cannot load an ApplicationContext with a NULL 'contextLoader'. Consider annotating your test class with @ContextConfiguration or @ContextHierarchy.
java.lang.IllegalStateException: Failed to load ApplicationContext
Caused by: java.lang.IllegalArgumentException: Cannot load an ApplicationContext with a NULL 'contextLoader'. Consider annotating your test class with @ContextConfiguration or @ContextHierarchy.
java.lang.IllegalStateException: Failed to load ApplicationContext
Caused by: java.lang.IllegalArgumentException: Cannot load an ApplicationContext with a NULL 'contextLoader'. Consider annotating your test class with @ContextConfiguration or @ContextHierarchy.
java.lang.IllegalStateException: Failed to load ApplicationContext
Caused by: java.lang.IllegalArgumentException: Cannot load an ApplicationContext with a NULL 'contextLoader'. Consider annotating your test class with @ContextConfiguration or @ContextHierarchy.
java.lang.IllegalStateException: Failed to load ApplicationContext
Caused by: java.lang.IllegalArgumentException: Cannot load an ApplicationContext with a NULL 'contextLoader'. Consider annotating your test class with @ContextConfiguration or @ContextHierarchy.
java.lang.IllegalStateException: Failed to load ApplicationContext
Caused by: java.lang.IllegalArgumentException: Cannot load an ApplicationContext with a NULL 'contextLoader'. Consider annotating your test class with @ContextConfiguration or @ContextHierarchy.
java.lang.IllegalStateException: Failed to load ApplicationContext
Caused by: java.lang.IllegalArgumentException: Cannot load an ApplicationContext with a NULL 'contextLoader'. Consider annotating your test class with @ContextConfiguration or @ContextHierarchy.
java.lang.IllegalStateException: Failed to load ApplicationContext
Caused by: java.lang.IllegalArgumentException: Cannot load an ApplicationContext with a NULL 'contextLoader'. Consider annotating your test class with @ContextConfiguration or @ContextHierarchy.
java.lang.IllegalStateException: Failed to load ApplicationContext
Caused by: java.lang.IllegalArgumentException: Cannot load an ApplicationContext with a NULL 'contextLoader'. Consider annotating your test class with @ContextConfiguration or @ContextHierarchy.
Fixed tests 3
Status Test Failing since View job Duration
Successful SinglePortFlowsIT verifyFlowStack History
Failing since build #84 (Changes by 3 people) Smoke Test (Flapping) 2 mins
Successful FlowStackKafkaIT verifyFlowStack History
Failing since build #84 (Changes by 3 people) Smoke Test (Flapping) 3 mins
Successful TopologyIT verifyNoVerticesFoundTextIsShown History
Failing since build #81 (Changes by Benjamin Reed) Smoke Test (Flapping) 49 secs

Jira issues

IssueDescriptionStatus
Unknown Issue TypeHZN-1420Could not obtain issue details from Jira
Unknown Issue TypeHZN-1469Could not obtain issue details from Jira