Build #82

Build: #82 failed Changes by Jesse White

Build result summary

Details

Completed
Duration
223 minutes
Labels
None
Revisions
OpenNMS (develop branch)
6f7a18b7e2dea53699b97f37a166b393127399ee 6f7a18b7e2dea53699b97f37a166b393127399ee
OpenNMS Installer
da12784d9ab4ba4aacedec0283d0c04075fd6ebf da12784d9ab4ba4aacedec0283d0c04075fd6ebf
OpenNMS-Repo
088d710674109759251f42c6720d74ea80cf3f13 088d710674109759251f42c6720d74ea80cf3f13
Smoke Tests
cb1e72265cf2ce10cb4872f58120272b340a1ce1 cb1e72265cf2ce10cb4872f58120272b340a1ce1
OpenNMS Bamboo Utils
a6d144f81c2df6f267b94e79328a0c8497980837 a6d144f81c2df6f267b94e79328a0c8497980837
OpenNMS System Test API
2baceb98eba956ca0f62f0e2d469d9f73b7ffd02 2baceb98eba956ca0f62f0e2d469d9f73b7ffd02
Total tests
4880
Failing since
#27 (Changes by mvrueden <mvrueden@users.noreply.github.com> and Jesse White)

Responsible

Code commits

OpenNMS (develop branch)
Author Commit Message Commit date
Jesse White Jesse White 6f7a18b7e2dea53699b97f37a166b393127399ee 6f7a18b7e2dea53699b97f37a166b393127399ee HZN-1449: Optimize implementation of  findLatestAcks() for systems with lots of acks (#2338)
* HZN-1449: Add an index to acks table to speed up grouping by refId.

Also limit the findLatestAcks query by time to avoid loading/returning unnecessary entries.

* HZN-1449: Add missing argument to LOG call.

Tests

New test failures 3
Status Test View job Duration
Collapse Failed SinglePortFlowsIT verifyFlowStack History
Smoke Test (Flapping) 2 mins
com.jayway.awaitility.core.ConditionTimeoutException: Condition with lambda expression in org.opennms.smoketest.telemetry.FlowTester that uses org.opennms.smoketest.telemetry.FlowTester$Block was not fulfilled within 1 minutes.
	at org.opennms.smoketest.flow.SinglePortFlowsIT.verifyFlowStack(SinglePortFlowsIT.java:100)
Collapse Failed JmxConfigurationGeneratorIT verifyCompMemberSelection History
Smoke Test (Flapping) 2 mins
org.openqa.selenium.TimeoutException: Timed out after 120 seconds waiting for org.opennms.smoketest.OpenNMSSeleniumTestCase$3@27051ae8
Build info: version: '2.53.1', revision: 'a36b8b1cd5757287168e54b817830adce9b0158d', time: '2016-06-30 19:26:09'
System info: host: 'carolina.internal.opennms.com', ip: '172.20.1.206', os.name: 'Linux', os.arch: 'amd64', os.version: '4.18.0-14-generic', java.version: '1.8.0_201'
Driver info: org.openqa.selenium.firefox.FirefoxDriver
Capabilities [{applicationCacheEnabled=true, rotatable=false, handlesAlerts=true, databaseEnabled=true, version=45.0.2, platform=LINUX, nativeEvents=false, acceptSslCerts=true, webStorageEnabled=true, locationContextEnabled=true, browserName=firefox, takesScreenshot=true, javascriptEnabled=true, cssSelectorsEnabled=true}]
Session ID: 4c7223c7-f7b3-4829-9128-5810a18874d2
org.openqa.selenium.TimeoutException: 
Timed out after 120 seconds waiting for org.opennms.smoketest.OpenNMSSeleniumTestCase$3@27051ae8
(6 more lines...)
Collapse Failed SFlowTelemetryAdapterIT verifyAdapter History
Smoke Test (Flapping) 6 mins
com.jayway.awaitility.core.ConditionTimeoutException: org.opennms.test.system.api.NewTestEnvironment.waitForOpenNMS Callable expected not null but was <null> within 5 minutes.
Existing test failures 24
Status Test Failing since View job Duration
java.lang.IllegalStateException: Failed to load ApplicationContext
	at org.springframework.test.context.cache.DefaultCacheAwareContextLoaderDelegate.loadContext(DefaultCacheAwareContextLoaderDelegate.java:124)
	at org.springframework.test.context.support.DefaultTestContext.getApplicationContext(DefaultTestContext.java:83)
	at org.springframework.test.context.support.DependencyInjectionTestExecutionListener.injectDependencies(DependencyInjectionTestExecutionListener.java:117)
	at org.springframework.test.context.support.DependencyInjectionTestExecutionListener.prepareTestInstance(DependencyInjectionTestExecutionListener.java:83)
	at org.springframework.test.context.TestContextManager.prepareTestInstance(TestContextManager.java:228)
	at org.springframework.test.context.junit4.SpringJUnit4ClassRunner.createTest(SpringJUnit4ClassRunner.java:230)
	at org.springframework.test.context.junit4.SpringJUnit4ClassRunner$1.runReflectiveCall(SpringJUnit4ClassRunner.java:289)
(52 more lines...)
java.lang.IllegalStateException: Failed to load ApplicationContext
Caused by: java.lang.IllegalArgumentException: Cannot load an ApplicationContext with a NULL 'contextLoader'. Consider annotating your test class with @ContextConfiguration or @ContextHierarchy.
java.lang.IllegalStateException: Failed to load ApplicationContext
Caused by: java.lang.IllegalArgumentException: Cannot load an ApplicationContext with a NULL 'contextLoader'. Consider annotating your test class with @ContextConfiguration or @ContextHierarchy.
java.lang.IllegalStateException: Failed to load ApplicationContext
Caused by: java.lang.IllegalArgumentException: Cannot load an ApplicationContext with a NULL 'contextLoader'. Consider annotating your test class with @ContextConfiguration or @ContextHierarchy.
java.lang.IllegalStateException: Failed to load ApplicationContext
Caused by: java.lang.IllegalArgumentException: Cannot load an ApplicationContext with a NULL 'contextLoader'. Consider annotating your test class with @ContextConfiguration or @ContextHierarchy.
java.lang.IllegalStateException: Failed to load ApplicationContext
Caused by: java.lang.IllegalArgumentException: Cannot load an ApplicationContext with a NULL 'contextLoader'. Consider annotating your test class with @ContextConfiguration or @ContextHierarchy.
java.lang.IllegalStateException: Failed to load ApplicationContext
Caused by: java.lang.IllegalArgumentException: Cannot load an ApplicationContext with a NULL 'contextLoader'. Consider annotating your test class with @ContextConfiguration or @ContextHierarchy.
java.lang.IllegalStateException: Failed to load ApplicationContext
Caused by: java.lang.IllegalArgumentException: Cannot load an ApplicationContext with a NULL 'contextLoader'. Consider annotating your test class with @ContextConfiguration or @ContextHierarchy.
java.lang.IllegalStateException: Failed to load ApplicationContext
Caused by: java.lang.IllegalArgumentException: Cannot load an ApplicationContext with a NULL 'contextLoader'. Consider annotating your test class with @ContextConfiguration or @ContextHierarchy.
java.lang.IllegalStateException: Failed to load ApplicationContext
Caused by: java.lang.IllegalArgumentException: Cannot load an ApplicationContext with a NULL 'contextLoader'. Consider annotating your test class with @ContextConfiguration or @ContextHierarchy.
java.lang.IllegalStateException: Failed to load ApplicationContext
Caused by: java.lang.IllegalArgumentException: Cannot load an ApplicationContext with a NULL 'contextLoader'. Consider annotating your test class with @ContextConfiguration or @ContextHierarchy.
java.lang.IllegalStateException: Failed to load ApplicationContext
Caused by: java.lang.IllegalArgumentException: Cannot load an ApplicationContext with a NULL 'contextLoader'. Consider annotating your test class with @ContextConfiguration or @ContextHierarchy.
java.lang.IllegalStateException: Failed to load ApplicationContext
Caused by: java.lang.IllegalArgumentException: Cannot load an ApplicationContext with a NULL 'contextLoader'. Consider annotating your test class with @ContextConfiguration or @ContextHierarchy.
java.lang.IllegalStateException: Failed to load ApplicationContext
Caused by: java.lang.IllegalArgumentException: Cannot load an ApplicationContext with a NULL 'contextLoader'. Consider annotating your test class with @ContextConfiguration or @ContextHierarchy.
java.lang.IllegalStateException: Failed to load ApplicationContext
Caused by: java.lang.IllegalArgumentException: Cannot load an ApplicationContext with a NULL 'contextLoader'. Consider annotating your test class with @ContextConfiguration or @ContextHierarchy.
java.lang.IllegalStateException: Failed to load ApplicationContext
Caused by: java.lang.IllegalArgumentException: Cannot load an ApplicationContext with a NULL 'contextLoader'. Consider annotating your test class with @ContextConfiguration or @ContextHierarchy.
java.lang.IllegalStateException: Failed to load ApplicationContext
Caused by: java.lang.IllegalArgumentException: Cannot load an ApplicationContext with a NULL 'contextLoader'. Consider annotating your test class with @ContextConfiguration or @ContextHierarchy.
java.lang.IllegalStateException: Failed to load ApplicationContext
Caused by: java.lang.IllegalArgumentException: Cannot load an ApplicationContext with a NULL 'contextLoader'. Consider annotating your test class with @ContextConfiguration or @ContextHierarchy.
java.lang.IllegalStateException: Failed to load ApplicationContext
Caused by: java.lang.IllegalArgumentException: Cannot load an ApplicationContext with a NULL 'contextLoader'. Consider annotating your test class with @ContextConfiguration or @ContextHierarchy.
java.lang.IllegalStateException: Failed to load ApplicationContext
Caused by: java.lang.IllegalArgumentException: Cannot load an ApplicationContext with a NULL 'contextLoader'. Consider annotating your test class with @ContextConfiguration or @ContextHierarchy.
java.lang.IllegalStateException: Failed to load ApplicationContext
Caused by: java.lang.IllegalArgumentException: Cannot load an ApplicationContext with a NULL 'contextLoader'. Consider annotating your test class with @ContextConfiguration or @ContextHierarchy.
org.junit.ComparisonFailure: expected:<Node [my-node-1 ]at SeleniumTestGroup> but was:<Node []at SeleniumTestGroup>
	at org.opennms.smoketest.EditInRequisitionIT.testIfDeployed(EditInRequisitionIT.java:84)
org.openqa.selenium.TimeoutException: Timed out after 120 seconds waiting for org.opennms.smoketest.OpenNMSSeleniumTestCase$3@687a762c
Build info: version: '2.53.1', revision: 'a36b8b1cd5757287168e54b817830adce9b0158d', time: '2016-06-30 19:26:09'
System info: host: 'carolina.internal.opennms.com', ip: '172.20.1.206', os.name: 'Linux', os.arch: 'amd64', os.version: '4.18.0-14-generic', java.version: '1.8.0_201'
Driver info: org.openqa.selenium.firefox.FirefoxDriver
Capabilities [{applicationCacheEnabled=true, rotatable=false, handlesAlerts=true, databaseEnabled=true, version=45.0.2, platform=LINUX, nativeEvents=false, acceptSslCerts=true, webStorageEnabled=true, locationContextEnabled=true, browserName=firefox, takesScreenshot=true, javascriptEnabled=true, cssSelectorsEnabled=true}]
Session ID: 14cd9d9a-2a49-4848-bb48-e1cc9440c665
org.openqa.selenium.TimeoutException: 
Timed out after 120 seconds waiting for org.opennms.smoketest.OpenNMSSeleniumTestCase$3@687a762c
(6 more lines...)
org.openqa.selenium.NoSuchElementException: Unable to locate element: {"method":"xpath","selector":"//*/table[@class='search-token-field']//div[@class='search-token-label' and contains(text(),'Node-3')]"}
Command duration or timeout: 1.10 seconds
For documentation on this error, please visit: http://seleniumhq.org/exceptions/no_such_element.html
Build info: version: '2.53.1', revision: 'a36b8b1cd5757287168e54b817830adce9b0158d', time: '2016-06-30 19:26:09'
System info: host: 'carolina.internal.opennms.com', ip: '172.20.1.206', os.name: 'Linux', os.arch: 'amd64', os.version: '4.18.0-14-generic', java.version: '1.8.0_201'
Driver info: org.openqa.selenium.firefox.FirefoxDriver
Capabilities [{applicationCacheEnabled=true, rotatable=false, handlesAlerts=true, databaseEnabled=true, version=45.0.2, platform=LINUX, nativeEvents=false, acceptSslCerts=true, webStorageEnabled=true, locationContextEnabled=true, browserName=firefox, takesScreenshot=true, javascriptEnabled=true, cssSelectorsEnabled=true}]
Session ID: 37bf9ca9-a919-4cc6-9c03-a2a9aa5b33af
(18 more lines...)
Fixed tests 3
Status Test Failing since View job Duration
Successful HealthCheckIT verifySentinelHealth History
Failing since build #81 (Changes by Benjamin Reed) Smoke Test (Flapping) 10 secs
Successful JmxConfigurationGeneratorIT testNavigation History
Failing since build #80 (Changes by Benjamin Reed) Smoke Test (Flapping) 30 secs
Successful SinglePortFlowsIT verifySinglePort History
Failing since build #81 (Changes by Benjamin Reed) Smoke Test (Flapping) 3 mins

Jira issues

IssueDescriptionStatus
Unknown Issue TypeHZN-1449Could not obtain issue details from Jira