Build #80

Build: #80 failed Changes by Benjamin Reed

Build result summary

Details

Completed
Duration
240 minutes
Labels
None
Revisions
OpenNMS (develop branch)
8943364145b40d364eb5772824d7ac6511d63664 8943364145b40d364eb5772824d7ac6511d63664
OpenNMS Installer
da12784d9ab4ba4aacedec0283d0c04075fd6ebf da12784d9ab4ba4aacedec0283d0c04075fd6ebf
OpenNMS-Repo
088d710674109759251f42c6720d74ea80cf3f13 088d710674109759251f42c6720d74ea80cf3f13
Smoke Tests
cb1e72265cf2ce10cb4872f58120272b340a1ce1 cb1e72265cf2ce10cb4872f58120272b340a1ce1
OpenNMS Bamboo Utils
a6d144f81c2df6f267b94e79328a0c8497980837 a6d144f81c2df6f267b94e79328a0c8497980837
OpenNMS System Test API
2baceb98eba956ca0f62f0e2d469d9f73b7ffd02 2baceb98eba956ca0f62f0e2d469d9f73b7ffd02
Total tests
4169
Failing since
#27 (Changes by mvrueden <mvrueden@users.noreply.github.com> and Jesse White)

Responsible

Code commits

OpenNMS (develop branch)
Author Commit Message Commit date
Benjamin Reed Benjamin Reed 8943364145b40d364eb5772824d7ac6511d63664 8943364145b40d364eb5772824d7ac6511d63664 Merge remote-tracking branch 'origin/release-23.0.3' into develop
Benjamin Reed Benjamin Reed e78ba1a4c066815d03538d1d7056b2eaa91633c5 m e78ba1a4c066815d03538d1d7056b2eaa91633c5 Merge remote-tracking branch 'origin/foundation-2018' into release-23.0.3
Benjamin Reed Benjamin Reed df55f4979905109fd4bc7ad100813a06fa1c97d4 m df55f4979905109fd4bc7ad100813a06fa1c97d4 fix annotations so flappers are properly ignored
Jesse White Jesse White a3b8bb639eb0612ac99e0133d676cc3afa89dbca m a3b8bb639eb0612ac99e0133d676cc3afa89dbca Merge pull request #2334 from OpenNMS/jira/NMS-10541
NMS-10541: fix debian install
Jesse White Jesse White bc8257645bf840e752c814353635db76516df7f7 m bc8257645bf840e752c814353635db76516df7f7 Merge pull request #2328 from OpenNMS/jira/NMS-10514
NMS-10514: Select Default location instead of the first alphabetically

Tests

New test failures 26
Status Test View job Duration
Collapse Failed SyslogMessageTest shouldHonorTimezoneWithoutConfiguredDefault History
Integration Test (Flapping) < 1 sec
java.lang.AssertionError: expected:<2018-02-03T17:21:20Z> but was:<2019-02-03T17:21:20Z>
	at org.junit.Assert.fail(Assert.java:88)
	at org.junit.Assert.failNotEquals(Assert.java:834)
	at org.junit.Assert.assertEquals(Assert.java:118)
	at org.junit.Assert.assertEquals(Assert.java:144)
	at org.opennms.netmgt.syslogd.SyslogMessageTest.checkDateParserWith(SyslogMessageTest.java:424)
	at org.opennms.netmgt.syslogd.SyslogMessageTest.shouldHonorTimezoneWithoutConfiguredDefault(SyslogMessageTest.java:403)
Collapse Failed SyslogMessageTest shouldHonorTimezoneWithConfiguredDefault History
Integration Test (Flapping) < 1 sec
java.lang.AssertionError: expected:<2018-02-03T11:21:20Z> but was:<2019-02-03T11:21:20Z>
	at org.junit.Assert.fail(Assert.java:88)
	at org.junit.Assert.failNotEquals(Assert.java:834)
	at org.junit.Assert.assertEquals(Assert.java:118)
	at org.junit.Assert.assertEquals(Assert.java:144)
	at org.opennms.netmgt.syslogd.SyslogMessageTest.checkDateParserWith(SyslogMessageTest.java:424)
	at org.opennms.netmgt.syslogd.SyslogMessageTest.shouldHonorTimezoneWithConfiguredDefault(SyslogMessageTest.java:398)
Collapse Failed BSMAdminIT testCanSetHighestSeverityAbove History
Smoke Test (Flapping) < 1 sec
java.lang.IllegalStateException: Failed to load ApplicationContext
Caused by: java.lang.IllegalArgumentException: Cannot load an ApplicationContext with a NULL 'contextLoader'. Consider annotating your test class with @ContextConfiguration or @ContextHierarchy.
Collapse Failed BSMAdminIT testCanExpandAndCollapse History
Smoke Test (Flapping) < 1 sec
java.lang.IllegalStateException: Failed to load ApplicationContext
Caused by: java.lang.IllegalArgumentException: Cannot load an ApplicationContext with a NULL 'contextLoader'. Consider annotating your test class with @ContextConfiguration or @ContextHierarchy.
Collapse Failed BSMAdminIT testCanEditPersistedReductionKeyFriendlyName History
Smoke Test (Flapping) < 1 sec
java.lang.IllegalStateException: Failed to load ApplicationContext
Caused by: java.lang.IllegalArgumentException: Cannot load an ApplicationContext with a NULL 'contextLoader'. Consider annotating your test class with @ContextConfiguration or @ContextHierarchy.
Collapse Failed BSMAdminIT testCanRemoveTransientEdge History
Smoke Test (Flapping) < 1 sec
java.lang.IllegalStateException: Failed to load ApplicationContext
Caused by: java.lang.IllegalArgumentException: Cannot load an ApplicationContext with a NULL 'contextLoader'. Consider annotating your test class with @ContextConfiguration or @ContextHierarchy.
Collapse Failed BSMAdminIT testCanEditPersistedEdge History
Smoke Test (Flapping) < 1 sec
java.lang.IllegalStateException: Failed to load ApplicationContext
Caused by: java.lang.IllegalArgumentException: Cannot load an ApplicationContext with a NULL 'contextLoader'. Consider annotating your test class with @ContextConfiguration or @ContextHierarchy.
Collapse Failed BSMAdminIT testCanAddMixedTypeEdges History
Smoke Test (Flapping) < 1 sec
java.lang.IllegalStateException: Failed to load ApplicationContext
Caused by: java.lang.IllegalArgumentException: Cannot load an ApplicationContext with a NULL 'contextLoader'. Consider annotating your test class with @ContextConfiguration or @ContextHierarchy.
Collapse Failed BSMAdminIT testCanEditTransientAttribute History
Smoke Test (Flapping) < 1 sec
java.lang.IllegalStateException: Failed to load ApplicationContext
Caused by: java.lang.IllegalArgumentException: Cannot load an ApplicationContext with a NULL 'contextLoader'. Consider annotating your test class with @ContextConfiguration or @ContextHierarchy.
Collapse Failed BSMAdminIT testCanCancelEdit History
Smoke Test (Flapping) < 1 sec
java.lang.IllegalStateException: Failed to load ApplicationContext
Caused by: java.lang.IllegalArgumentException: Cannot load an ApplicationContext with a NULL 'contextLoader'. Consider annotating your test class with @ContextConfiguration or @ContextHierarchy.
Collapse Failed BSMAdminIT testCanCreateAndDeleteBusinessServiceWithThreshold History
Smoke Test (Flapping) < 1 sec
java.lang.IllegalStateException: Failed to load ApplicationContext
Caused by: java.lang.IllegalArgumentException: Cannot load an ApplicationContext with a NULL 'contextLoader'. Consider annotating your test class with @ContextConfiguration or @ContextHierarchy.
Collapse Failed BSMAdminIT testCanAddBusinessServiceEdge History
Smoke Test (Flapping) < 1 sec
java.lang.IllegalStateException: Failed to load ApplicationContext
Caused by: java.lang.IllegalArgumentException: Cannot load an ApplicationContext with a NULL 'contextLoader'. Consider annotating your test class with @ContextConfiguration or @ContextHierarchy.
Collapse Failed BSMAdminIT testCanRenameBusinessService History
Smoke Test (Flapping) < 1 sec
java.lang.IllegalStateException: Failed to load ApplicationContext
Caused by: java.lang.IllegalArgumentException: Cannot load an ApplicationContext with a NULL 'contextLoader'. Consider annotating your test class with @ContextConfiguration or @ContextHierarchy.
Collapse Failed BSMAdminIT testCanFilterBusinessServices History
Smoke Test (Flapping) < 1 sec
java.lang.IllegalStateException: Failed to load ApplicationContext
Caused by: java.lang.IllegalArgumentException: Cannot load an ApplicationContext with a NULL 'contextLoader'. Consider annotating your test class with @ContextConfiguration or @ContextHierarchy.
Collapse Failed BSMAdminIT testCanEditTransientReductionKeyFriendlyName History
Smoke Test (Flapping) < 1 sec
java.lang.IllegalStateException: Failed to load ApplicationContext
Caused by: java.lang.IllegalArgumentException: Cannot load an ApplicationContext with a NULL 'contextLoader'. Consider annotating your test class with @ContextConfiguration or @ContextHierarchy.
Collapse Failed BSMAdminIT testCanAddApplicationEdge History
Smoke Test (Flapping) < 1 sec
java.lang.IllegalStateException: Failed to load ApplicationContext
Caused by: java.lang.IllegalArgumentException: Cannot load an ApplicationContext with a NULL 'contextLoader'. Consider annotating your test class with @ContextConfiguration or @ContextHierarchy.
Collapse Failed BSMAdminIT testCanRemovePersistedEdge History
Smoke Test (Flapping) < 1 sec
java.lang.IllegalStateException: Failed to load ApplicationContext
Caused by: java.lang.IllegalArgumentException: Cannot load an ApplicationContext with a NULL 'contextLoader'. Consider annotating your test class with @ContextConfiguration or @ContextHierarchy.
Collapse Failed BSMAdminIT testCanAddReductionKeyEdge History
Smoke Test (Flapping) < 1 sec
java.lang.IllegalStateException: Failed to load ApplicationContext
Caused by: java.lang.IllegalArgumentException: Cannot load an ApplicationContext with a NULL 'contextLoader'. Consider annotating your test class with @ContextConfiguration or @ContextHierarchy.
Collapse Failed BSMAdminIT testCanCreateAndDeleteBusinessService History
Smoke Test (Flapping) < 1 sec
java.lang.IllegalStateException: Failed to load ApplicationContext
Caused by: java.lang.IllegalArgumentException: Cannot load an ApplicationContext with a NULL 'contextLoader'. Consider annotating your test class with @ContextConfiguration or @ContextHierarchy.
Collapse Failed BSMAdminIT testCanEditPersistedAttribute History
Smoke Test (Flapping) < 1 sec
java.lang.IllegalStateException: Failed to load ApplicationContext
Caused by: java.lang.IllegalArgumentException: Cannot load an ApplicationContext with a NULL 'contextLoader'. Consider annotating your test class with @ContextConfiguration or @ContextHierarchy.
Collapse Failed BSMAdminIT testCanAddIpServiceEdge History
Smoke Test (Flapping) < 1 sec
java.lang.IllegalStateException: Failed to load ApplicationContext
Caused by: java.lang.IllegalArgumentException: Cannot load an ApplicationContext with a NULL 'contextLoader'. Consider annotating your test class with @ContextConfiguration or @ContextHierarchy.
Collapse Failed BSMAdminIT testCanEditTransientEdge History
Smoke Test (Flapping) < 1 sec
java.lang.IllegalStateException: Failed to load ApplicationContext
Caused by: java.lang.IllegalArgumentException: Cannot load an ApplicationContext with a NULL 'contextLoader'. Consider annotating your test class with @ContextConfiguration or @ContextHierarchy.
Collapse Failed JmxConfigurationGeneratorIT testNavigation History
Smoke Test (Flapping) 2 mins
org.openqa.selenium.TimeoutException: Timed out after 120 seconds waiting for org.opennms.smoketest.OpenNMSSeleniumTestCase$3@36a7abe1
Build info: version: '2.53.1', revision: 'a36b8b1cd5757287168e54b817830adce9b0158d', time: '2016-06-30 19:26:09'
System info: host: 'bambooagent04.internal.opennms.com', ip: '172.20.1.208', os.name: 'Linux', os.arch: 'amd64', os.version: '4.15.0-44-generic', java.version: '1.8.0_201'
Driver info: org.openqa.selenium.firefox.FirefoxDriver
Capabilities [{applicationCacheEnabled=true, rotatable=false, handlesAlerts=true, databaseEnabled=true, version=45.0.2, platform=LINUX, nativeEvents=false, acceptSslCerts=true, webStorageEnabled=true, locationContextEnabled=true, browserName=firefox, takesScreenshot=true, javascriptEnabled=true, cssSelectorsEnabled=true}]
Session ID: d5c11801-f2df-4a3b-8580-605e231b57e4
org.openqa.selenium.TimeoutException: 
Timed out after 120 seconds waiting for org.opennms.smoketest.OpenNMSSeleniumTestCase$3@36a7abe1
(6 more lines...)
Collapse Failed OpsBoardAdminPageIT canCreateAndUseDeepLink History
Smoke Test (Flapping) 2 mins
org.openqa.selenium.TimeoutException: Timed out after 120 seconds waiting for org.opennms.smoketest.OpenNMSSeleniumTestCase$3@53d87b2d
Build info: version: '2.53.1', revision: 'a36b8b1cd5757287168e54b817830adce9b0158d', time: '2016-06-30 19:26:09'
System info: host: 'bambooagent04.internal.opennms.com', ip: '172.20.1.208', os.name: 'Linux', os.arch: 'amd64', os.version: '4.15.0-44-generic', java.version: '1.8.0_201'
Driver info: org.openqa.selenium.firefox.FirefoxDriver
Capabilities [{applicationCacheEnabled=true, rotatable=false, handlesAlerts=true, databaseEnabled=true, version=45.0.2, platform=LINUX, nativeEvents=false, acceptSslCerts=true, webStorageEnabled=true, locationContextEnabled=true, browserName=firefox, takesScreenshot=true, javascriptEnabled=true, cssSelectorsEnabled=true}]
Session ID: 56ea3ca3-27ce-4cd2-86f0-b22479b4318c
org.openqa.selenium.TimeoutException: 
Timed out after 120 seconds waiting for org.opennms.smoketest.OpenNMSSeleniumTestCase$3@53d87b2d
(6 more lines...)
Collapse Failed XRequestedWithRestIT verifyWWWAuthenticate History
Smoke Test (Flapping) 16 secs
java.lang.AssertionError: 1 expectation failed.
Expected header "WWW-Authenticate" was not a string containing "Basic", was "null". Headers are:
Date=Fri, 01 Feb 2019 10:45:31 GMT
Content-Length=0
Server=Jetty(9.4.14.v20181114)

java.lang.AssertionError: 
1 expectation failed.
(6 more lines...)
Collapse Failed SFlowTelemetryAdapterIT verifyAdapter History
Smoke Test (Flapping) 10 mins
com.jayway.awaitility.core.ConditionTimeoutException: Condition with lambda expression in org.opennms.smoketest.utils.KarafShell was not fulfilled within 5 minutes.
Existing test failures 1
Status Test Failing since View job Duration
org.junit.ComparisonFailure: expected:<Node [my-node-1 ]at SeleniumTestGroup> but was:<Node []at SeleniumTestGroup>
	at org.opennms.smoketest.EditInRequisitionIT.testIfDeployed(EditInRequisitionIT.java:84)
Fixed tests 2
Status Test Failing since View job Duration
Successful FlowStackJmsIT verifyFlowStack History
Failing since build #79 (Changes by Patrick Schweizer <patrick@schweizer-ing.com> and Jesse White) Smoke Test (Flapping) 2 mins
Successful TopologyIT verifyNoVerticesFoundTextIsShown History
Failing since build #79 (Changes by Patrick Schweizer <patrick@schweizer-ing.com> and Jesse White) Smoke Test (Flapping) 49 secs

Jira issues

IssueDescriptionStatus
Unknown Issue TypeNMS-10514Could not obtain issue details from Jira
Unknown Issue TypeNMS-10541Could not obtain issue details from Jira