Build #76

Build: #76 failed Changes by Benjamin Reed

Build result summary

Details

Completed
Duration
439 minutes
Labels
None
Revisions
OpenNMS (develop branch)
b42931c216d2a0cc4be5e67530426f1b141f2a88 b42931c216d2a0cc4be5e67530426f1b141f2a88
OpenNMS Installer
da12784d9ab4ba4aacedec0283d0c04075fd6ebf da12784d9ab4ba4aacedec0283d0c04075fd6ebf
OpenNMS-Repo
088d710674109759251f42c6720d74ea80cf3f13 088d710674109759251f42c6720d74ea80cf3f13
Smoke Tests
cb1e72265cf2ce10cb4872f58120272b340a1ce1 cb1e72265cf2ce10cb4872f58120272b340a1ce1
OpenNMS Bamboo Utils
a6d144f81c2df6f267b94e79328a0c8497980837 a6d144f81c2df6f267b94e79328a0c8497980837
OpenNMS System Test API
2baceb98eba956ca0f62f0e2d469d9f73b7ffd02 2baceb98eba956ca0f62f0e2d469d9f73b7ffd02
Total tests
7997
Failing since
#27 (Changes by mvrueden <mvrueden@users.noreply.github.com> and Jesse White)

Responsible

Code commits

OpenNMS (develop branch)
Author Commit Message Commit date
Benjamin Reed Benjamin Reed b42931c216d2a0cc4be5e67530426f1b141f2a88 b42931c216d2a0cc4be5e67530426f1b141f2a88 Merge remote-tracking branch 'origin/release-23.0.3' into develop
Benjamin Reed Benjamin Reed 90cefe6a6a20f8358b2a788292a2421e898c2083 m 90cefe6a6a20f8358b2a788292a2421e898c2083 Merge remote-tracking branch 'origin/foundation-2018' into release-23.0.3
Benjamin Reed Benjamin Reed 48ae1b9ab1f2dae98f4b573bd4c5a6ee24af88e1 m 48ae1b9ab1f2dae98f4b573bd4c5a6ee24af88e1 this typo bugged me ;)
Jesse White Jesse White 10667aecfffd17f925e97cd28fc403baeb5ec7c3 m 10667aecfffd17f925e97cd28fc403baeb5ec7c3 Merge pull request #2315 from OpenNMS/jira/NMS-10515
NMS-10515: Fixed navigator's view handling
Bamboo Administrator Bamboo Administrator 1caf75dd76a5c25e61c26637b471ff3f39ac7c3e m 1caf75dd76a5c25e61c26637b471ff3f39ac7c3e [bamboo] Automated branch merge (from foundation-2018:3684ddae7a4f113fc26437c147ba9fb217cabde0)

Tests

New test failures 2
Status Test View job Duration
Collapse Failed ChooseResourcesPageIT verifyGraphAll History
Smoke Test (Flapping) 4 mins
org.opennms.smoketest.OpenNMSTestException: org.opennms.smoketest.OpenNMSTestException: org.openqa.selenium.TimeoutException: Timed out after 240 seconds waiting for org.opennms.smoketest.OpenNMSSeleniumTestCase$WaitForNodesInDatabase@72c21c9f
Build info: version: '2.53.1', revision: 'a36b8b1cd5757287168e54b817830adce9b0158d', time: '2016-06-30 19:26:09'
System info: host: 'bambooagent04.internal.opennms.com', ip: '172.20.1.208', os.name: 'Linux', os.arch: 'amd64', os.version: '4.15.0-43-generic', java.version: '1.8.0_201'
Driver info: org.openqa.selenium.firefox.FirefoxDriver
Capabilities [{applicationCacheEnabled=true, rotatable=false, handlesAlerts=true, databaseEnabled=true, version=45.0.2, platform=LINUX, nativeEvents=false, acceptSslCerts=true, webStorageEnabled=true, locationContextEnabled=true, browserName=firefox, takesScreenshot=true, javascriptEnabled=true, cssSelectorsEnabled=true}]
Session ID: 401312e8-1763-438e-bbb6-f84814455b30
org.opennms.smoketest.OpenNMSTestException: 
org.opennms.smoketest.OpenNMSTestException: org.openqa.selenium.TimeoutException: Timed out after 240 seconds waiting for org.opennms.smoketest.OpenNMSSeleniumTestCase$WaitForNodesInDatabase@72c21c9f
(22 more lines...)
Collapse Failed OpsBoardAdminPageIT canCreateAndUseDeepLink History
Smoke Test (Flapping) 26 secs
org.openqa.selenium.TimeoutException: Timed out after 5 seconds waiting for org.opennms.smoketest.OpenNMSSeleniumTestCase$3@6ba355e4
Build info: version: '2.53.1', revision: 'a36b8b1cd5757287168e54b817830adce9b0158d', time: '2016-06-30 19:26:09'
System info: host: 'bambooagent04.internal.opennms.com', ip: '172.20.1.208', os.name: 'Linux', os.arch: 'amd64', os.version: '4.15.0-43-generic', java.version: '1.8.0_201'
Driver info: org.openqa.selenium.firefox.FirefoxDriver
Capabilities [{applicationCacheEnabled=true, rotatable=false, handlesAlerts=true, databaseEnabled=true, version=45.0.2, platform=LINUX, nativeEvents=false, acceptSslCerts=true, webStorageEnabled=true, locationContextEnabled=true, browserName=firefox, takesScreenshot=true, javascriptEnabled=true, cssSelectorsEnabled=true}]
Session ID: ade10f85-7db8-450d-adf0-21a5a1b2bec0
org.openqa.selenium.TimeoutException: 
Timed out after 5 seconds waiting for org.opennms.smoketest.OpenNMSSeleniumTestCase$3@6ba355e4
(6 more lines...)
Existing test failures 1
Status Test Failing since View job Duration
org.openqa.selenium.TimeoutException: Timed out after 120 seconds waiting for org.opennms.smoketest.OpenNMSSeleniumTestCase$3@3caf5c96
Build info: version: '2.53.1', revision: 'a36b8b1cd5757287168e54b817830adce9b0158d', time: '2016-06-30 19:26:09'
System info: host: 'bambooagent04.internal.opennms.com', ip: '172.20.1.208', os.name: 'Linux', os.arch: 'amd64', os.version: '4.15.0-43-generic', java.version: '1.8.0_201'
Driver info: org.openqa.selenium.firefox.FirefoxDriver
Capabilities [{applicationCacheEnabled=true, rotatable=false, handlesAlerts=true, databaseEnabled=true, version=45.0.2, platform=LINUX, nativeEvents=false, acceptSslCerts=true, webStorageEnabled=true, locationContextEnabled=true, browserName=firefox, takesScreenshot=true, javascriptEnabled=true, cssSelectorsEnabled=true}]
Session ID: a76a55c5-afa2-45ba-9e21-f70dc5aa9d8a
org.openqa.selenium.TimeoutException: 
Timed out after 120 seconds waiting for org.opennms.smoketest.OpenNMSSeleniumTestCase$3@3caf5c96
(6 more lines...)
Fixed tests 3
Status Test Failing since View job Duration
Successful HeartbeatSinkPerfIT quickRun History
Failing since build #75 (Changes by Patrick Schweizer <patrick@schweizer-ing.com> and Jesse White) Integration Test (Flapping) 3 secs
Successful HealthCheckIT verifySentinelHealth History
Failing since build #75 (Changes by Patrick Schweizer <patrick@schweizer-ing.com> and Jesse White) Smoke Test (Flapping) 10 secs
Successful JtiTelemetryAdapterIT verifyAdapter History
Failing since build #74 (Changes by Jesse White) Smoke Test (Flapping) 3 mins

Jira issues

IssueDescriptionStatus
Unknown Issue TypeNMS-10515Could not obtain issue details from Jira
Unknown Issue TypeNMS-10525Could not obtain issue details from Jira