Build #74

Build: #74 failed Changes by Jesse White

Build result summary

Details

Completed
Duration
270 minutes
Labels
None
Revisions
OpenNMS (develop branch)
0d5bb340b5d12518894b2e581d998d3efb819d68 0d5bb340b5d12518894b2e581d998d3efb819d68
OpenNMS Installer
da12784d9ab4ba4aacedec0283d0c04075fd6ebf da12784d9ab4ba4aacedec0283d0c04075fd6ebf
OpenNMS-Repo
088d710674109759251f42c6720d74ea80cf3f13 088d710674109759251f42c6720d74ea80cf3f13
Smoke Tests
cb1e72265cf2ce10cb4872f58120272b340a1ce1 cb1e72265cf2ce10cb4872f58120272b340a1ce1
OpenNMS Bamboo Utils
a6d144f81c2df6f267b94e79328a0c8497980837 a6d144f81c2df6f267b94e79328a0c8497980837
OpenNMS System Test API
2baceb98eba956ca0f62f0e2d469d9f73b7ffd02 2baceb98eba956ca0f62f0e2d469d9f73b7ffd02
Total tests
7993
Failing since
#27 (Changes by mvrueden <mvrueden@users.noreply.github.com> and Jesse White)

Responsible

Code commits

OpenNMS (develop branch)
Author Commit Message Commit date
Jesse White Jesse White 0d5bb340b5d12518894b2e581d998d3efb819d68 0d5bb340b5d12518894b2e581d998d3efb819d68 Merge pull request #2288 from OpenNMS/jira/NMS-10505
NMS-10505: Add opennms logging configuration for karaf containers
Chandra Gorantla <chandra@opennms.com> Chandra Gorantla <chandra@opennms.com> 88f18f1e85e632962bd07b5e11d0102a4298c71a m 88f18f1e85e632962bd07b5e11d0102a4298c71a Merge branch 'develop' into jira/NMS-10505
Chandra Gorantla <chandra@opennms.com> Chandra Gorantla <chandra@opennms.com> c191425465223dc47621954c015e6be6e4104dda m c191425465223dc47621954c015e6be6e4104dda NMS-10505: Add opennms logging configuration

Tests

New test failures 5
Status Test View job Duration
Collapse Failed BSMAdminIT testCanEditPersistedAttribute History
Smoke Test (Flapping) 2 mins
org.openqa.selenium.NoSuchElementException: Unable to locate element: {"method":"xpath","selector":"//*[contains(., 'foo=123')]"}
Command duration or timeout: 120.04 seconds
For documentation on this error, please visit: http://seleniumhq.org/exceptions/no_such_element.html
Build info: version: '2.53.1', revision: 'a36b8b1cd5757287168e54b817830adce9b0158d', time: '2016-06-30 19:26:09'
System info: host: 'bambooagent04.internal.opennms.com', ip: '172.20.1.208', os.name: 'Linux', os.arch: 'amd64', os.version: '4.15.0-43-generic', java.version: '1.8.0_201'
Driver info: org.openqa.selenium.firefox.FirefoxDriver
Capabilities [{applicationCacheEnabled=true, rotatable=false, handlesAlerts=true, databaseEnabled=true, version=45.0.2, platform=LINUX, nativeEvents=false, acceptSslCerts=true, webStorageEnabled=true, locationContextEnabled=true, browserName=firefox, takesScreenshot=true, javascriptEnabled=true, cssSelectorsEnabled=true}]
Session ID: f5b4abda-26ec-474a-971c-b158ad0e36eb
(19 more lines...)
Collapse Failed BSMAdminIT testCanFilterBusinessServices History
Smoke Test (Flapping) 1 min
java.lang.AssertionError: expected null, but was:<[[FirefoxDriver: firefox on LINUX (f884a107-03e4-4b1d-bbeb-79ed1a115c95)] -> id: deleteButton-XXX]>
	at org.opennms.smoketest.BSMAdminIT.assertBusinessServicesAreHidden(BSMAdminIT.java:947)
	at org.opennms.smoketest.BSMAdminIT.testCanFilterBusinessServices(BSMAdminIT.java:1027)
Collapse Failed NodeDetailPageIT canUseViewInTopology History
Smoke Test (Flapping) 21 secs
java.lang.AssertionError: expected:<1> but was:<0>
	at org.opennms.smoketest.NodeDetailPageIT.canUseViewInTopology(NodeDetailPageIT.java:107)
Collapse Failed JtiTelemetryAdapterIT verifyAdapter History
Smoke Test (Flapping) 10 mins
com.jayway.awaitility.core.ConditionTimeoutException: Condition with lambda expression in org.opennms.smoketest.utils.KarafShell was not fulfilled within 5 minutes.
Collapse Failed TopologyIT verifyNoVerticesFoundTextIsShown History
Smoke Test (Flapping) 36 secs
org.openqa.selenium.NoSuchElementException: Unable to locate element: {"method":"xpath","selector":"//*/table[@class='search-token-field']//div[@class='search-token-label' and contains(text(),'Node-3')]"}
Command duration or timeout: 1.00 seconds
For documentation on this error, please visit: http://seleniumhq.org/exceptions/no_such_element.html
Build info: version: '2.53.1', revision: 'a36b8b1cd5757287168e54b817830adce9b0158d', time: '2016-06-30 19:26:09'
System info: host: 'bambooagent04.internal.opennms.com', ip: '172.20.1.208', os.name: 'Linux', os.arch: 'amd64', os.version: '4.15.0-43-generic', java.version: '1.8.0_201'
Driver info: org.openqa.selenium.firefox.FirefoxDriver
Capabilities [{applicationCacheEnabled=true, rotatable=false, handlesAlerts=true, databaseEnabled=true, version=45.0.2, platform=LINUX, nativeEvents=false, acceptSslCerts=true, webStorageEnabled=true, locationContextEnabled=true, browserName=firefox, takesScreenshot=true, javascriptEnabled=true, cssSelectorsEnabled=true}]
Session ID: e1b031a1-628f-4e2c-a947-556ba1e979a7
(18 more lines...)
Existing test failures 1
Status Test Failing since View job Duration
com.jayway.awaitility.core.ConditionTimeoutException: Condition with lambda expression in org.opennms.test.system.api.NewTestEnvironment that uses java.net.InetSocketAddress was not fulfilled within 5 minutes.
Fixed tests 1
Status Test Failing since View job Duration
Successful BSMAdminIT testCanEditTransientAttribute History
Failing since build #73 (Changes by Patrick Schweizer <patrick@schweizer-ing.com> and Benjamin Reed) Smoke Test (Flapping) 34 secs

Jira issues

IssueDescriptionStatus
Unknown Issue TypeNMS-10505Could not obtain issue details from Jira