Build result summary

Details

Completed
Duration
308 minutes
Labels
None
Revisions
OpenNMS (develop branch)
e08c963ddf54d0e695dae159dda29975743da5eb e08c963ddf54d0e695dae159dda29975743da5eb
OpenNMS Installer
da12784d9ab4ba4aacedec0283d0c04075fd6ebf da12784d9ab4ba4aacedec0283d0c04075fd6ebf
OpenNMS-Repo
088d710674109759251f42c6720d74ea80cf3f13 088d710674109759251f42c6720d74ea80cf3f13
Smoke Tests
cb1e72265cf2ce10cb4872f58120272b340a1ce1 cb1e72265cf2ce10cb4872f58120272b340a1ce1
OpenNMS Bamboo Utils
a6d144f81c2df6f267b94e79328a0c8497980837 a6d144f81c2df6f267b94e79328a0c8497980837
OpenNMS System Test API
4257a65d402e6d847612079cacf3f9ddcfdd9ca5 4257a65d402e6d847612079cacf3f9ddcfdd9ca5
Total tests
8015
Failing since
#27 (Changes by mvrueden <mvrueden@users.noreply.github.com> and Jesse White)

Responsible

Code commits

OpenNMS (develop branch)
Author Commit Message Commit date
DavidSmith <38085611+smith-opennms@users.noreply.github.com> DavidSmith <38085611+smith-opennms@users.noreply.github.com> e08c963ddf54d0e695dae159dda29975743da5eb e08c963ddf54d0e695dae159dda29975743da5eb HZN-1426 Make Older Alarms Un-Acknowledge Situations (#2229)
* HZN-1426: Allow old alarms to un-Ack Situation. Add AlarmAssociation to WorkingMemory

* HZN-1426: missing Copyright

* HZN-1426: incr time before persisting results when ticking out

* HZN-1426: Add toString for debugging

* HZN-1426: Cleanup imports

* HZN-1426: Add rule and test for old.unAck.alarm to un.ack Stituation

* HZN-1426: Fixes for issues in testing. Fixes for review feedback

* HZN-1426: Send correctly updated situation with prior alarms to notifier

* HZN-1426: Make copy of related alarms Set
OpenNMS System Test API
Author Commit Message Commit date
Benjamin Reed Benjamin Reed 4257a65d402e6d847612079cacf3f9ddcfdd9ca5 4257a65d402e6d847612079cacf3f9ddcfdd9ca5 add sudo to the base image, clean /var/cache/yum as recommended by `yum clean`

Tests

New test failures 4
Status Test View job Duration
Collapse Failed BSMAdminIT testCanFilterBusinessServices History
Smoke Test (Flapping) 1 min
java.lang.AssertionError: expected null, but was:<[[FirefoxDriver: firefox on LINUX (d1d9b0c7-08a7-45ce-b951-e429313ec541)] -> id: deleteButton-XXX]>
	at org.opennms.smoketest.BSMAdminIT.assertBusinessServicesAreHidden(BSMAdminIT.java:895)
	at org.opennms.smoketest.BSMAdminIT.testCanFilterBusinessServices(BSMAdminIT.java:975)
Collapse Failed BSMAdminIT testCanEditPersistedAttribute History
Smoke Test (Flapping) 2 mins
org.openqa.selenium.TimeoutException: Timed out after 120 seconds waiting for org.opennms.smoketest.OpenNMSSeleniumTestCase$3@2c73a332
Build info: version: '2.53.1', revision: 'a36b8b1cd5757287168e54b817830adce9b0158d', time: '2016-06-30 19:26:09'
System info: host: 'stanford.internal.opennms.com', ip: '172.20.1.204', os.name: 'Linux', os.arch: 'amd64', os.version: '4.4.0-139-generic', java.version: '1.8.0_191'
Driver info: org.openqa.selenium.firefox.FirefoxDriver
Capabilities [{applicationCacheEnabled=true, rotatable=false, handlesAlerts=true, databaseEnabled=true, version=48.0, platform=LINUX, nativeEvents=false, acceptSslCerts=true, webStorageEnabled=true, locationContextEnabled=true, browserName=firefox, takesScreenshot=true, javascriptEnabled=true, cssSelectorsEnabled=true}]
Session ID: e207f0b1-b139-493a-ac53-582a7fd378ca
org.openqa.selenium.TimeoutException: 
Timed out after 120 seconds waiting for org.opennms.smoketest.OpenNMSSeleniumTestCase$3@2c73a332
(6 more lines...)
Collapse Failed TopologyIT verifyPingOperation History
Smoke Test (Flapping) 39 secs
org.openqa.selenium.NoSuchElementException: Unable to locate element: {"method":"xpath","selector":"//*/table[@class='search-token-field']//div[@class='search-token-label' and contains(text(),'Node-3')]"}
Command duration or timeout: 1.12 seconds
For documentation on this error, please visit: http://seleniumhq.org/exceptions/no_such_element.html
Build info: version: '2.53.1', revision: 'a36b8b1cd5757287168e54b817830adce9b0158d', time: '2016-06-30 19:26:09'
System info: host: 'stanford.internal.opennms.com', ip: '172.20.1.204', os.name: 'Linux', os.arch: 'amd64', os.version: '4.4.0-139-generic', java.version: '1.8.0_191'
Driver info: org.openqa.selenium.firefox.FirefoxDriver
Capabilities [{applicationCacheEnabled=true, rotatable=false, handlesAlerts=true, databaseEnabled=true, version=48.0, platform=LINUX, nativeEvents=false, acceptSslCerts=true, webStorageEnabled=true, locationContextEnabled=true, browserName=firefox, takesScreenshot=true, javascriptEnabled=true, cssSelectorsEnabled=true}]
Session ID: a9b41fa6-7ae9-485c-a970-4ff3ed3ec4d0
(18 more lines...)
Collapse Failed TopologyIT verifyIpLikeSearchNoDuplicates History
Smoke Test (Flapping) 2 mins
java.lang.AssertionError: expected:<1> but was:<0>
	at org.opennms.smoketest.TopologyIT.verifyIpLikeSearchNoDuplicates(TopologyIT.java:891)
Fixed tests 2
Status Test Failing since View job Duration
Successful MinionHeartbeatOutageIT testHeartbeatOutages History
Failing since build #27 (Changes by mvrueden <mvrueden@users.noreply.github.com> and Jesse White) Smoke Test (Flapping) 7 mins
Successful JtiTelemetryAdapterIT verifyAdapter History
Failing since build #27 (Changes by mvrueden <mvrueden@users.noreply.github.com> and Jesse White) Smoke Test (Flapping) 4 mins

Jira issues

IssueDescriptionStatus
Unknown Issue TypeHZN-1426Could not obtain issue details from Jira