Build #157

Build: #157 failed Changes by Bamboo Administrator

Build result summary

Details

Completed
Duration
1267 minutes
Labels
None
Revisions
OpenNMS (develop branch)
94136657b01690208b8e17afbc2ddbfd5efa49b4 94136657b01690208b8e17afbc2ddbfd5efa49b4
OpenNMS Installer
da12784d9ab4ba4aacedec0283d0c04075fd6ebf da12784d9ab4ba4aacedec0283d0c04075fd6ebf
OpenNMS-Repo
4e156ac6b8804bf3905913b3e27d832c6f53902e 4e156ac6b8804bf3905913b3e27d832c6f53902e
Smoke Tests
cb1e72265cf2ce10cb4872f58120272b340a1ce1 cb1e72265cf2ce10cb4872f58120272b340a1ce1
OpenNMS Bamboo Utils
0cc2b016b53a4c518d5d3276b6087e05db232bde 0cc2b016b53a4c518d5d3276b6087e05db232bde
OpenNMS System Test API
2f3a985377db43ce9b451390b9744bac402ffbd7 2f3a985377db43ce9b451390b9744bac402ffbd7
Total tests
2901
Failing since
#27 (Changes by mvrueden <mvrueden@users.noreply.github.com> and Jesse White)

Responsible

Code commits

OpenNMS (develop branch)
Author Commit Message Commit date
Bamboo Administrator Bamboo Administrator 94136657b01690208b8e17afbc2ddbfd5efa49b4 94136657b01690208b8e17afbc2ddbfd5efa49b4 [bamboo] Automated branch merge (from release-24.1.0:7d09d1a807f7e4612fa23092ec397335f22e479d)
mvrueden <mvrueden@users.noreply.github.com> mvrueden <mvrueden@users.noreply.github.com> 7d09d1a807f7e4612fa23092ec397335f22e479d m 7d09d1a807f7e4612fa23092ec397335f22e479d Merge pull request #2492 from OpenNMS/jira/NMS-10675
NMS-10675: Fix missing isModified indicator
Markus von Rüden Markus von Rüden 128cd31ff3b1b85f84efe050147b7d4005d332b3 m 128cd31ff3b1b85f84efe050147b7d4005d332b3 NMS-10675: Fix missing isModified indicator

Tests

New test failures 6
Status Test View job Duration
Collapse Failed LocationAwareDetectorClientIT canDetectViaCurrentLocation History
Integration Test (Flapping) < 1 sec
java.lang.IllegalStateException: Failed to load ApplicationContext
	at org.springframework.test.context.cache.DefaultCacheAwareContextLoaderDelegate.loadContext(DefaultCacheAwareContextLoaderDelegate.java:124)
	at org.springframework.test.context.support.DefaultTestContext.getApplicationContext(DefaultTestContext.java:83)
	at org.springframework.test.context.support.DependencyInjectionTestExecutionListener.injectDependencies(DependencyInjectionTestExecutionListener.java:117)
	at org.springframework.test.context.support.DependencyInjectionTestExecutionListener.prepareTestInstance(DependencyInjectionTestExecutionListener.java:83)
	at org.springframework.test.context.TestContextManager.prepareTestInstance(TestContextManager.java:228)
	at org.springframework.test.context.junit4.SpringJUnit4ClassRunner.createTest(SpringJUnit4ClassRunner.java:230)
	at org.springframework.test.context.junit4.SpringJUnit4ClassRunner$1.runReflectiveCall(SpringJUnit4ClassRunner.java:289)
(171 more lines...)
Collapse Failed LocationAwareDetectorClientIT canDetectViaAnotherLocation History
Integration Test (Flapping) < 1 sec
java.lang.IllegalStateException: Failed to load ApplicationContext
	at org.springframework.test.context.cache.DefaultCacheAwareContextLoaderDelegate.loadContext(DefaultCacheAwareContextLoaderDelegate.java:124)
	at org.springframework.test.context.support.DefaultTestContext.getApplicationContext(DefaultTestContext.java:83)
	at org.springframework.test.context.support.DependencyInjectionTestExecutionListener.injectDependencies(DependencyInjectionTestExecutionListener.java:117)
	at org.springframework.test.context.support.DependencyInjectionTestExecutionListener.prepareTestInstance(DependencyInjectionTestExecutionListener.java:83)
	at org.springframework.test.context.TestContextManager.prepareTestInstance(TestContextManager.java:228)
	at org.springframework.test.context.junit4.SpringJUnit4ClassRunner.createTest(SpringJUnit4ClassRunner.java:230)
	at org.springframework.test.context.junit4.SpringJUnit4ClassRunner$1.runReflectiveCall(SpringJUnit4ClassRunner.java:289)
(171 more lines...)
Collapse Failed LocationAwareDetectorClientIT org.opennms.netmgt.provision.detector.client.rpc.LocationAwareDetectorClientIT History
Integration Test (Flapping) < 1 sec
java.lang.Exception: ActiveMQ broker was not started or stopped unexpectedly. Error: org.apache.activemq.broker.BrokerStoppedException: Stop invoked
	at org.opennms.core.test.activemq.ActiveMQBroker.before(ActiveMQBroker.java:56)
	at org.junit.rules.ExternalResource$1.evaluate(ExternalResource.java:46)
	at org.junit.rules.RunRules.evaluate(RunRules.java:20)
	at org.junit.runners.ParentRunner.run(ParentRunner.java:363)
	at org.springframework.test.context.junit4.SpringJUnit4ClassRunner.run(SpringJUnit4ClassRunner.java:193)
	at org.apache.maven.surefire.junit4.JUnit4Provider.execute(JUnit4Provider.java:275)
	at org.apache.maven.surefire.junit4.JUnit4Provider.executeWithRerun(JUnit4Provider.java:183)
(5 more lines...)
Collapse Failed LocationAwareDetectorClientIT didOverrideBodyDebug History
Integration Test (Flapping) < 1 sec
java.lang.IllegalStateException: Failed to load ApplicationContext
	at org.springframework.test.context.cache.DefaultCacheAwareContextLoaderDelegate.loadContext(DefaultCacheAwareContextLoaderDelegate.java:124)
	at org.springframework.test.context.support.DefaultTestContext.getApplicationContext(DefaultTestContext.java:83)
	at org.springframework.test.context.support.DependencyInjectionTestExecutionListener.injectDependencies(DependencyInjectionTestExecutionListener.java:117)
	at org.springframework.test.context.support.DependencyInjectionTestExecutionListener.prepareTestInstance(DependencyInjectionTestExecutionListener.java:83)
	at org.springframework.test.context.TestContextManager.prepareTestInstance(TestContextManager.java:228)
	at org.springframework.test.context.junit4.SpringJUnit4ClassRunner.createTest(SpringJUnit4ClassRunner.java:230)
	at org.springframework.test.context.junit4.SpringJUnit4ClassRunner$1.runReflectiveCall(SpringJUnit4ClassRunner.java:289)
(171 more lines...)
Collapse Failed RpcOverKafkaIT verifyKafkaRpcWithJdbcServiceDetection History
Smoke Test (Flapping) 3 mins
com.jayway.awaitility.core.ConditionTimeoutException: Lambda expression in org.opennms.smoketest.minion.RpcOverKafkaIT: expected a string containing "'JDBC' WAS detected" but was < 172.17.0.3 url=jdbc:postgresql://172.17.0.3:5432/opennms
Trying to detect 'JDBC' on '172.17.0.3' .............................
Detection failed with: java.util.concurrent.ExecutionException: org.opennms.core.rpc.api.RequestTimedOutException: java.util.concurrent.TimeoutException
admin@opennms> logout
> within 3 minutes.
com.jayway.awaitility.core.ConditionTimeoutException: 
Lambda expression in org.opennms.smoketest.minion.RpcOverKafkaIT: expected a string containing "'JDBC' WAS detected" but was < 172.17.0.3 url=jdbc:postgresql://172.17.0.3:5432/opennms

(6 more lines...)
Collapse Failed RpcOverKafkaIT verifyKafkaRpcWithIcmpServiceDetection History
Smoke Test (Flapping) 3 mins
com.jayway.awaitility.core.ConditionTimeoutException: Lambda expression in org.opennms.smoketest.minion.RpcOverKafkaIT: expected a string containing "'ICMP' WAS detected on 127.0.0.1" but was <
Trying to detect 'ICMP' on '127.0.0.1' .............................
Detection failed with: java.util.concurrent.ExecutionException: org.opennms.core.rpc.api.RequestTimedOutException: java.util.concurrent.TimeoutException
admin@opennms> logout
> within 3 minutes.
com.jayway.awaitility.core.ConditionTimeoutException: 
Lambda expression in org.opennms.smoketest.minion.RpcOverKafkaIT: expected a string containing "'ICMP' WAS detected on 127.0.0.1" but was <

(6 more lines...)
Existing test failures 20
Status Test Failing since View job Duration
java.lang.IllegalStateException: Failed to load ApplicationContext
Caused by: java.lang.IllegalArgumentException: Cannot load an ApplicationContext with a NULL 'contextLoader'. Consider annotating your test class with @ContextConfiguration or @ContextHierarchy.
java.lang.IllegalStateException: Failed to load ApplicationContext
Caused by: java.lang.IllegalArgumentException: Cannot load an ApplicationContext with a NULL 'contextLoader'. Consider annotating your test class with @ContextConfiguration or @ContextHierarchy.
java.lang.IllegalStateException: Failed to load ApplicationContext
Caused by: java.lang.IllegalArgumentException: Cannot load an ApplicationContext with a NULL 'contextLoader'. Consider annotating your test class with @ContextConfiguration or @ContextHierarchy.
java.lang.IllegalStateException: Failed to load ApplicationContext
Caused by: java.lang.IllegalArgumentException: Cannot load an ApplicationContext with a NULL 'contextLoader'. Consider annotating your test class with @ContextConfiguration or @ContextHierarchy.
java.lang.IllegalStateException: Failed to load ApplicationContext
Caused by: java.lang.IllegalArgumentException: Cannot load an ApplicationContext with a NULL 'contextLoader'. Consider annotating your test class with @ContextConfiguration or @ContextHierarchy.
java.lang.IllegalStateException: Failed to load ApplicationContext
Caused by: java.lang.IllegalArgumentException: Cannot load an ApplicationContext with a NULL 'contextLoader'. Consider annotating your test class with @ContextConfiguration or @ContextHierarchy.
java.lang.IllegalStateException: Failed to load ApplicationContext
Caused by: java.lang.IllegalArgumentException: Cannot load an ApplicationContext with a NULL 'contextLoader'. Consider annotating your test class with @ContextConfiguration or @ContextHierarchy.
java.lang.IllegalStateException: Failed to load ApplicationContext
Caused by: java.lang.IllegalArgumentException: Cannot load an ApplicationContext with a NULL 'contextLoader'. Consider annotating your test class with @ContextConfiguration or @ContextHierarchy.
java.lang.IllegalStateException: Failed to load ApplicationContext
Caused by: java.lang.IllegalArgumentException: Cannot load an ApplicationContext with a NULL 'contextLoader'. Consider annotating your test class with @ContextConfiguration or @ContextHierarchy.
java.lang.IllegalStateException: Failed to load ApplicationContext
Caused by: java.lang.IllegalArgumentException: Cannot load an ApplicationContext with a NULL 'contextLoader'. Consider annotating your test class with @ContextConfiguration or @ContextHierarchy.
java.lang.IllegalStateException: Failed to load ApplicationContext
Caused by: java.lang.IllegalArgumentException: Cannot load an ApplicationContext with a NULL 'contextLoader'. Consider annotating your test class with @ContextConfiguration or @ContextHierarchy.
java.lang.IllegalStateException: Failed to load ApplicationContext
Caused by: java.lang.IllegalArgumentException: Cannot load an ApplicationContext with a NULL 'contextLoader'. Consider annotating your test class with @ContextConfiguration or @ContextHierarchy.
java.lang.IllegalStateException: Failed to load ApplicationContext
Caused by: java.lang.IllegalArgumentException: Cannot load an ApplicationContext with a NULL 'contextLoader'. Consider annotating your test class with @ContextConfiguration or @ContextHierarchy.
java.lang.IllegalStateException: Failed to load ApplicationContext
Caused by: java.lang.IllegalArgumentException: Cannot load an ApplicationContext with a NULL 'contextLoader'. Consider annotating your test class with @ContextConfiguration or @ContextHierarchy.
java.lang.IllegalStateException: Failed to load ApplicationContext
Caused by: java.lang.IllegalArgumentException: Cannot load an ApplicationContext with a NULL 'contextLoader'. Consider annotating your test class with @ContextConfiguration or @ContextHierarchy.
java.lang.IllegalStateException: Failed to load ApplicationContext
Caused by: java.lang.IllegalArgumentException: Cannot load an ApplicationContext with a NULL 'contextLoader'. Consider annotating your test class with @ContextConfiguration or @ContextHierarchy.
java.lang.IllegalStateException: Failed to load ApplicationContext
Caused by: java.lang.IllegalArgumentException: Cannot load an ApplicationContext with a NULL 'contextLoader'. Consider annotating your test class with @ContextConfiguration or @ContextHierarchy.
java.lang.IllegalStateException: Failed to load ApplicationContext
Caused by: java.lang.IllegalArgumentException: Cannot load an ApplicationContext with a NULL 'contextLoader'. Consider annotating your test class with @ContextConfiguration or @ContextHierarchy.
java.lang.IllegalStateException: Failed to load ApplicationContext
Caused by: java.lang.IllegalArgumentException: Cannot load an ApplicationContext with a NULL 'contextLoader'. Consider annotating your test class with @ContextConfiguration or @ContextHierarchy.
java.lang.IllegalStateException: Failed to load ApplicationContext
Caused by: java.lang.IllegalArgumentException: Cannot load an ApplicationContext with a NULL 'contextLoader'. Consider annotating your test class with @ContextConfiguration or @ContextHierarchy.
Fixed tests 2
Status Test Failing since View job Duration
Successful HeartbeatSinkPerfIT quickRun History
Failing since build #156 (Changes by mvrueden <mvrueden@users.noreply.github.com>) Integration Test (Flapping) 3 secs
Successful XRequestedWithRestIT verifyWWWAuthenticate History
Failing since build #155 (Changes by Bamboo Administrator) Smoke Test (Flapping) 14 secs

Jira issues

IssueDescriptionStatus
Unknown Issue TypeNMS-10675Could not obtain issue details from Jira