Build #156

Build result summary

Details

Completed
Duration
86 minutes
Labels
None
Revisions
OpenNMS (develop branch)
010b2b3288cc7d8fe67f5189e91b3aa14960ce48 010b2b3288cc7d8fe67f5189e91b3aa14960ce48
OpenNMS Installer
da12784d9ab4ba4aacedec0283d0c04075fd6ebf da12784d9ab4ba4aacedec0283d0c04075fd6ebf
OpenNMS-Repo
4e156ac6b8804bf3905913b3e27d832c6f53902e 4e156ac6b8804bf3905913b3e27d832c6f53902e
Smoke Tests
cb1e72265cf2ce10cb4872f58120272b340a1ce1 cb1e72265cf2ce10cb4872f58120272b340a1ce1
OpenNMS Bamboo Utils
0cc2b016b53a4c518d5d3276b6087e05db232bde 0cc2b016b53a4c518d5d3276b6087e05db232bde
OpenNMS System Test API
2f3a985377db43ce9b451390b9744bac402ffbd7 2f3a985377db43ce9b451390b9744bac402ffbd7
Total tests
2179
Failing since
#27 (Changes by mvrueden <mvrueden@users.noreply.github.com> and Jesse White)

Tests

Responsible

Code commits

OpenNMS (develop branch)
Author Commit Message Commit date
mvrueden <mvrueden@users.noreply.github.com> mvrueden <mvrueden@users.noreply.github.com> 010b2b3288cc7d8fe67f5189e91b3aa14960ce48 010b2b3288cc7d8fe67f5189e91b3aa14960ce48 Merge pull request #2494 from OpenNMS/mvr/compile-with-java-9
Changes to compile under Java 9
Markus von Rüden Markus von Rüden 437cb916efe3f021cd055bd48d124687d74355db m 437cb916efe3f021cd055bd48d124687d74355db Remove unused dependency
Markus von Rüden Markus von Rüden 50d36352aac6a5d220c834279d9635081ef2b032 m 50d36352aac6a5d220c834279d9635081ef2b032 Temporarily disable cxf-karaf-commands
Markus von Rüden Markus von Rüden e804e20470188b3d811c9a96bdcca4623ae4b825 m e804e20470188b3d811c9a96bdcca4623ae4b825 Exclude build dependency from 3rd party library which leaks in as transitive dependency

Tests

New test failures 2
Status Test View job Duration
Collapse Failed HeartbeatSinkPerfIT quickRun History
Integration Test (Flapping) 2 secs
java.lang.NullPointerException: null
	at org.opennms.core.ipc.sink.camel.itests.HeartbeatSinkPerfIT.setUp(HeartbeatSinkPerfIT.java:165)
Collapse Failed HeartbeatSinkPerfIT org.opennms.core.ipc.sink.camel.itests.HeartbeatSinkPerfIT History
Integration Test (Flapping) 2 secs
java.lang.Exception: ActiveMQ broker was not started or stopped unexpectedly. Error: org.apache.activemq.broker.BrokerStoppedException: Stop invoked
	at org.opennms.core.test.activemq.ActiveMQBroker.before(ActiveMQBroker.java:56)
	at org.junit.rules.ExternalResource$1.evaluate(ExternalResource.java:46)
	at org.junit.rules.RunRules.evaluate(RunRules.java:20)
	at org.junit.runners.ParentRunner.run(ParentRunner.java:363)
	at org.springframework.test.context.junit4.SpringJUnit4ClassRunner.run(SpringJUnit4ClassRunner.java:193)
	at org.apache.maven.surefire.junit4.JUnit4Provider.execute(JUnit4Provider.java:275)
	at org.apache.maven.surefire.junit4.JUnit4Provider.executeWithRerun(JUnit4Provider.java:183)
(5 more lines...)