Build #132

Build: #132 failed Changes by Jesse White

Build result summary

Details

Completed
Duration
329 minutes
Labels
None
Revisions
OpenNMS (develop branch)
bce569e822a79ebcba2b387acc4a4563a81c7db1 bce569e822a79ebcba2b387acc4a4563a81c7db1
OpenNMS Installer
da12784d9ab4ba4aacedec0283d0c04075fd6ebf da12784d9ab4ba4aacedec0283d0c04075fd6ebf
OpenNMS-Repo
088d710674109759251f42c6720d74ea80cf3f13 088d710674109759251f42c6720d74ea80cf3f13
Smoke Tests
cb1e72265cf2ce10cb4872f58120272b340a1ce1 cb1e72265cf2ce10cb4872f58120272b340a1ce1
OpenNMS Bamboo Utils
0a62053bc90f6ffcce1e17256674b2dae7b4f8a3 0a62053bc90f6ffcce1e17256674b2dae7b4f8a3
OpenNMS System Test API
2f3a985377db43ce9b451390b9744bac402ffbd7 2f3a985377db43ce9b451390b9744bac402ffbd7
Total tests
2385
Failing since
#27 (Changes by mvrueden <mvrueden@users.noreply.github.com> and Jesse White)

Responsible

This build has been failing since #27
No one has taken responsibility

Code commits

OpenNMS (develop branch)
Author Commit Message Commit date
Jesse White Jesse White bce569e822a79ebcba2b387acc4a4563a81c7db1 bce569e822a79ebcba2b387acc4a4563a81c7db1 Merge remote-tracking branch 'origin/release-24.0.0' into develop
Bamboo Administrator Bamboo Administrator 71b46fbb906c62863cb8ce2bbc1921298bd13649 m 71b46fbb906c62863cb8ce2bbc1921298bd13649 [bamboo] Automated branch merge (from foundation-2018:2bae3f3d8445e44b87faac3c824eedfbbd09f379)
Bamboo Administrator Bamboo Administrator 2bae3f3d8445e44b87faac3c824eedfbbd09f379 m 2bae3f3d8445e44b87faac3c824eedfbbd09f379 [bamboo] Automated branch merge (from foundation-2017:0d26e71149df00ffcc6191518ff1542e2991d8bb)
DavidSmith <38085611+smith-opennms@users.noreply.github.com> DavidSmith <38085611+smith-opennms@users.noreply.github.com> e39f78e9ae47d61c9bfa785add158df413599c6c m e39f78e9ae47d61c9bfa785add158df413599c6c HZN-1492: Support for SituationFeedback (#2417)
RootCause and Tags

commit e775898960cd3461c5dcb1f83b4309d6e6b7146d
Author: David Smith <smith@opennms.com>
Date:   Mon Apr 8 17:43:45 2019 -0400

    HZN-1492: qualify POST endpoint

commit 88acfb1158afba87f8d4301774f50e0f4f07eb2e
Author: David Smith <smith@opennms.com>
Date:   Mon Apr 8 09:57:00 2019 -0400

    HZN-1492: fix last commit

commit 92227ed24cc6f0999d841eb1ec42c39bbe25d712
Author: Matthew Brooks <Matt@mattbrooks.ca>
Date:   Fri Apr 5 14:21:28 2019 -0400

    Update features/situation-feedback/api/src/main/java/org/opennms/features/situationfeedback/api/AlarmFeedback.java

commit 4afab02030c4bcee6e2be4b4caad9f04f0267045
Author: David Smith <smith@opennms.com>
Date:   Wed Apr 3 21:09:27 2019 -0400

    HZN-1492: renamed root cause builder. added simple test

commit cc57efddd94911dfa6aa9aeffe102aac3d98c7f9
Author: David Smith <smith@opennms.com>
Date:   Tue Apr 2 14:22:29 2019 -0400

    HZN-1492: review feedback

commit 214eda11087704bec1d818845c7f0254a952e895
Author: Matthew Brooks <Matt@mattbrooks.ca>
Date:   Tue Apr 2 11:46:43 2019 -0400

    Update features/situation-feedback/api/src/main/java/org/opennms/features/situationfeedback/api/AlarmFeedback.java

    Co-Authored-By: smith-opennms <38085611+smith-opennms@users.noreply.github.com>

commit de76dba343f3e195d5e9ec96ee37032a21fbc4ba
Author: David Smith <smith@opennms.com>
Date:   Tue Apr 2 11:24:18 2019 -0400

    HZN-1492: Refactor Elastic Health Check

commit cfea5ed41e1b6542ad0781ed2311298d61ca3e14
Author: David Smith <smith@opennms.com>
Date:   Mon Apr 1 12:23:44 2019 -0400

    HZN-1492: Rest Enpoint naming

commit 252999a4eba29623d34b7dc89a1cfc93e27394b3
Author: David Smith <smith@opennms.com>
Date:   Mon Apr 1 12:02:53 2019 -0400

    HZN-1492: Code cleanup

commit 72c8d45bf63ca5fdbb2b8f55404617aa0d0dadcf
Author: David Smith <smith@opennms.com>
Date:   Mon Apr 1 11:51:14 2019 -0400

    HZN-1492: Adding healthCheck support to Feedback Elastic feature

commit ff8ce7a95eb10f1ddc7166bbc62ed9fc6dbdf8b5
Author: David Smith <smith@opennms.com>
Date:   Fri Mar 29 17:15:24 2019 -0400

    HZN-1492: reading and writing root_cause and tags

commit 807ac8f775c7d457b42835ed49a0ecb13dd3c0a5
Author: David Smith <smith@opennms.com>
Date:   Fri Mar 29 14:11:50 2019 -0400

    HZN-1492: Storing and retrieving rootCause and tags

commit 39af24bc29dc70432cf36bcd014f27ea537e92bc
Author: David Smith <smith@opennms.com>
Date:   Wed Mar 27 17:50:26 2019 -0400

    HZN-1492: Situation Feedback rootCause, tags, createSituation

commit d52ee75c8c862c68ce2abaf4f48abf52fd83441a
Author: David Smith <smith@opennms.com>
Date:   Tue Mar 26 17:39:56 2019 -0400

    HZN-1492: Add Roo Cause to Situation Feedback
Bamboo Administrator Bamboo Administrator 0d26e71149df00ffcc6191518ff1542e2991d8bb m 0d26e71149df00ffcc6191518ff1542e2991d8bb [bamboo] Automated branch merge (from foundation-2016:a84f34ab1ded3323934839a2a27b25d6030459ae)

Tests

Existing test failures 23
Status Test Failing since View job Duration
java.lang.AssertionError: null
	at org.junit.Assert.fail(Assert.java:86)
	at org.junit.Assert.assertTrue(Assert.java:41)
	at org.junit.Assert.assertNotNull(Assert.java:712)
	at org.junit.Assert.assertNotNull(Assert.java:722)
	at org.opennms.core.ipc.sink.camel.itests.SinkBlueprintMessageFailureIT.doesntLogMessageBody(SinkBlueprintMessageFailureIT.java:141)
java.lang.Exception: ActiveMQ broker was not started or stopped unexpectedly. Error: org.apache.activemq.broker.BrokerStoppedException: Stop invoked
	at org.opennms.core.test.activemq.ActiveMQBroker.before(ActiveMQBroker.java:56)
	at org.junit.rules.ExternalResource$1.evaluate(ExternalResource.java:46)
	at org.junit.rules.RunRules.evaluate(RunRules.java:20)
	at org.junit.runners.ParentRunner.run(ParentRunner.java:363)
	at org.springframework.test.context.junit4.SpringJUnit4ClassRunner.run(SpringJUnit4ClassRunner.java:193)
	at org.apache.maven.surefire.junit4.JUnit4Provider.execute(JUnit4Provider.java:275)
	at org.apache.maven.surefire.junit4.JUnit4Provider.executeWithRerun(JUnit4Provider.java:183)
(5 more lines...)
java.lang.IllegalStateException: Failed to load ApplicationContext
Caused by: java.lang.IllegalArgumentException: Cannot load an ApplicationContext with a NULL 'contextLoader'. Consider annotating your test class with @ContextConfiguration or @ContextHierarchy.
java.lang.IllegalStateException: Failed to load ApplicationContext
Caused by: java.lang.IllegalArgumentException: Cannot load an ApplicationContext with a NULL 'contextLoader'. Consider annotating your test class with @ContextConfiguration or @ContextHierarchy.
java.lang.IllegalStateException: Failed to load ApplicationContext
Caused by: java.lang.IllegalArgumentException: Cannot load an ApplicationContext with a NULL 'contextLoader'. Consider annotating your test class with @ContextConfiguration or @ContextHierarchy.
java.lang.IllegalStateException: Failed to load ApplicationContext
Caused by: java.lang.IllegalArgumentException: Cannot load an ApplicationContext with a NULL 'contextLoader'. Consider annotating your test class with @ContextConfiguration or @ContextHierarchy.
java.lang.IllegalStateException: Failed to load ApplicationContext
Caused by: java.lang.IllegalArgumentException: Cannot load an ApplicationContext with a NULL 'contextLoader'. Consider annotating your test class with @ContextConfiguration or @ContextHierarchy.
java.lang.IllegalStateException: Failed to load ApplicationContext
Caused by: java.lang.IllegalArgumentException: Cannot load an ApplicationContext with a NULL 'contextLoader'. Consider annotating your test class with @ContextConfiguration or @ContextHierarchy.
java.lang.IllegalStateException: Failed to load ApplicationContext
Caused by: java.lang.IllegalArgumentException: Cannot load an ApplicationContext with a NULL 'contextLoader'. Consider annotating your test class with @ContextConfiguration or @ContextHierarchy.
java.lang.IllegalStateException: Failed to load ApplicationContext
Caused by: java.lang.IllegalArgumentException: Cannot load an ApplicationContext with a NULL 'contextLoader'. Consider annotating your test class with @ContextConfiguration or @ContextHierarchy.
java.lang.IllegalStateException: Failed to load ApplicationContext
Caused by: java.lang.IllegalArgumentException: Cannot load an ApplicationContext with a NULL 'contextLoader'. Consider annotating your test class with @ContextConfiguration or @ContextHierarchy.
java.lang.IllegalStateException: Failed to load ApplicationContext
Caused by: java.lang.IllegalArgumentException: Cannot load an ApplicationContext with a NULL 'contextLoader'. Consider annotating your test class with @ContextConfiguration or @ContextHierarchy.
java.lang.IllegalStateException: Failed to load ApplicationContext
Caused by: java.lang.IllegalArgumentException: Cannot load an ApplicationContext with a NULL 'contextLoader'. Consider annotating your test class with @ContextConfiguration or @ContextHierarchy.
java.lang.IllegalStateException: Failed to load ApplicationContext
Caused by: java.lang.IllegalArgumentException: Cannot load an ApplicationContext with a NULL 'contextLoader'. Consider annotating your test class with @ContextConfiguration or @ContextHierarchy.
java.lang.IllegalStateException: Failed to load ApplicationContext
Caused by: java.lang.IllegalArgumentException: Cannot load an ApplicationContext with a NULL 'contextLoader'. Consider annotating your test class with @ContextConfiguration or @ContextHierarchy.
java.lang.IllegalStateException: Failed to load ApplicationContext
Caused by: java.lang.IllegalArgumentException: Cannot load an ApplicationContext with a NULL 'contextLoader'. Consider annotating your test class with @ContextConfiguration or @ContextHierarchy.
java.lang.IllegalStateException: Failed to load ApplicationContext
Caused by: java.lang.IllegalArgumentException: Cannot load an ApplicationContext with a NULL 'contextLoader'. Consider annotating your test class with @ContextConfiguration or @ContextHierarchy.
java.lang.IllegalStateException: Failed to load ApplicationContext
Caused by: java.lang.IllegalArgumentException: Cannot load an ApplicationContext with a NULL 'contextLoader'. Consider annotating your test class with @ContextConfiguration or @ContextHierarchy.
java.lang.IllegalStateException: Failed to load ApplicationContext
Caused by: java.lang.IllegalArgumentException: Cannot load an ApplicationContext with a NULL 'contextLoader'. Consider annotating your test class with @ContextConfiguration or @ContextHierarchy.
java.lang.IllegalStateException: Failed to load ApplicationContext
Caused by: java.lang.IllegalArgumentException: Cannot load an ApplicationContext with a NULL 'contextLoader'. Consider annotating your test class with @ContextConfiguration or @ContextHierarchy.
java.lang.IllegalStateException: Failed to load ApplicationContext
Caused by: java.lang.IllegalArgumentException: Cannot load an ApplicationContext with a NULL 'contextLoader'. Consider annotating your test class with @ContextConfiguration or @ContextHierarchy.
java.lang.IllegalStateException: Failed to load ApplicationContext
Caused by: java.lang.IllegalArgumentException: Cannot load an ApplicationContext with a NULL 'contextLoader'. Consider annotating your test class with @ContextConfiguration or @ContextHierarchy.
org.openqa.selenium.TimeoutException: Timed out after 120 seconds waiting for org.opennms.smoketest.OpenNMSSeleniumTestCase$3@266cb987
Build info: version: '2.53.1', revision: 'a36b8b1cd5757287168e54b817830adce9b0158d', time: '2016-06-30 19:26:09'
System info: host: 'bambooagent05.internal.opennms.com', ip: '172.20.1.209', os.name: 'Linux', os.arch: 'amd64', os.version: '4.15.0-47-generic', java.version: '1.8.0_201'
Driver info: org.openqa.selenium.firefox.FirefoxDriver
Capabilities [{applicationCacheEnabled=true, rotatable=false, handlesAlerts=true, databaseEnabled=true, version=45.0.2, platform=LINUX, nativeEvents=false, acceptSslCerts=true, webStorageEnabled=true, locationContextEnabled=true, browserName=firefox, takesScreenshot=true, javascriptEnabled=true, cssSelectorsEnabled=true}]
Session ID: 01188690-9984-4541-8d8c-7be2ed99b135
org.openqa.selenium.TimeoutException: 
Timed out after 120 seconds waiting for org.opennms.smoketest.OpenNMSSeleniumTestCase$3@266cb987
(6 more lines...)
Fixed tests 1
Status Test Failing since View job Duration
Successful XRequestedWithRestIT verifyWWWAuthenticate History
Failing since build #131 (Changes by Chandra Gorantla <chandra@opennms.com>) Smoke Test (Flapping) 13 secs

Jira issues

IssueDescriptionStatus
Unknown Issue TypeHZN-1492Could not obtain issue details from Jira
Unknown Issue TypeNMS-10654Could not obtain issue details from Jira
Unknown Issue TypeOCE-55Could not obtain issue details from Jira