Build: #128 failed Changes by Bamboo Administrator

Build result summary

Details

Completed
Duration
375 minutes
Labels
None
Revisions
OpenNMS (develop branch)
b77e98602fbd1581bf8c854d1420318913516195 b77e98602fbd1581bf8c854d1420318913516195
OpenNMS Installer
da12784d9ab4ba4aacedec0283d0c04075fd6ebf da12784d9ab4ba4aacedec0283d0c04075fd6ebf
OpenNMS-Repo
088d710674109759251f42c6720d74ea80cf3f13 088d710674109759251f42c6720d74ea80cf3f13
Smoke Tests
cb1e72265cf2ce10cb4872f58120272b340a1ce1 cb1e72265cf2ce10cb4872f58120272b340a1ce1
OpenNMS Bamboo Utils
0a62053bc90f6ffcce1e17256674b2dae7b4f8a3 0a62053bc90f6ffcce1e17256674b2dae7b4f8a3
OpenNMS System Test API
2f3a985377db43ce9b451390b9744bac402ffbd7 2f3a985377db43ce9b451390b9744bac402ffbd7
Total tests
2385
Failing since
#27 (Changes by mvrueden <mvrueden@users.noreply.github.com> and Jesse White)

Responsible

Code commits

OpenNMS (develop branch)
Author Commit Message Commit date
Bamboo Administrator Bamboo Administrator b77e98602fbd1581bf8c854d1420318913516195 b77e98602fbd1581bf8c854d1420318913516195 [bamboo] Automated branch merge (from release-24.0.0:d94115d9c28c68166a8c1de498761ba03bc56123)
Jesse White Jesse White d94115d9c28c68166a8c1de498761ba03bc56123 m d94115d9c28c68166a8c1de498761ba03bc56123 Merge branch 'release-24.0.0' of github.com:OpenNMS/opennms into release-24.0.0
Jesse White Jesse White 72072d8b97e4662e28318bfb429c4498effbcfd1 m 72072d8b97e4662e28318bfb429c4498effbcfd1 NMS-10594: Fix the DefaultAlarmTicketerService to use transactions when updating the alarm entities.

Tests

New test failures 4
Status Test View job Duration
Collapse Failed HeartbeatSinkBlueprintIT org.opennms.core.ipc.sink.camel.itests.HeartbeatSinkBlueprintIT History
Integration Test (Flapping) 7 secs
java.lang.Exception: ActiveMQ broker was not started or stopped unexpectedly. Error: org.apache.activemq.broker.BrokerStoppedException: Stop invoked
	at org.opennms.core.test.activemq.ActiveMQBroker.before(ActiveMQBroker.java:56)
	at org.junit.rules.ExternalResource$1.evaluate(ExternalResource.java:46)
	at org.junit.rules.RunRules.evaluate(RunRules.java:20)
	at org.junit.runners.ParentRunner.run(ParentRunner.java:363)
	at org.springframework.test.context.junit4.SpringJUnit4ClassRunner.run(SpringJUnit4ClassRunner.java:193)
	at org.apache.maven.surefire.junit4.JUnit4Provider.execute(JUnit4Provider.java:275)
	at org.apache.maven.surefire.junit4.JUnit4Provider.executeWithRerun(JUnit4Provider.java:183)
(5 more lines...)
Collapse Failed HeartbeatSinkBlueprintIT canProduceAndConsumerMessages History
Integration Test (Flapping) 2 secs
java.lang.NullPointerException: null
	at org.opennms.core.ipc.sink.camel.itests.HeartbeatSinkBlueprintIT.canProduceAndConsumerMessages(HeartbeatSinkBlueprintIT.java:146)
Collapse Failed EditInRequisitionIT testIfDeployed History
Smoke Test (Flapping) 19 secs
org.junit.ComparisonFailure: expected:<Node [my-node-1 ]at SeleniumTestGroup> but was:<Node []at SeleniumTestGroup>
	at org.opennms.smoketest.EditInRequisitionIT.testIfDeployed(EditInRequisitionIT.java:84)
Collapse Failed OpsBoardAdminPageIT canCreateAndUseDeepLink History
Smoke Test (Flapping) 2 mins
org.openqa.selenium.TimeoutException: Timed out after 120 seconds waiting for org.opennms.smoketest.OpenNMSSeleniumTestCase$3@14fed48e
Build info: version: '2.53.1', revision: 'a36b8b1cd5757287168e54b817830adce9b0158d', time: '2016-06-30 19:26:09'
System info: host: 'bambooagent04.internal.opennms.com', ip: '172.20.1.208', os.name: 'Linux', os.arch: 'amd64', os.version: '4.15.0-47-generic', java.version: '1.8.0_201'
Driver info: org.openqa.selenium.firefox.FirefoxDriver
Capabilities [{applicationCacheEnabled=true, rotatable=false, handlesAlerts=true, databaseEnabled=true, version=45.0.2, platform=LINUX, nativeEvents=false, acceptSslCerts=true, webStorageEnabled=true, locationContextEnabled=true, browserName=firefox, takesScreenshot=true, javascriptEnabled=true, cssSelectorsEnabled=true}]
Session ID: 251bc372-ba40-438c-8e9b-7cff27038adc
org.openqa.selenium.TimeoutException: 
Timed out after 120 seconds waiting for org.opennms.smoketest.OpenNMSSeleniumTestCase$3@14fed48e
(6 more lines...)
Existing test failures 20
Status Test Failing since View job Duration
java.lang.IllegalStateException: Failed to load ApplicationContext
Caused by: java.lang.IllegalArgumentException: Cannot load an ApplicationContext with a NULL 'contextLoader'. Consider annotating your test class with @ContextConfiguration or @ContextHierarchy.
java.lang.IllegalStateException: Failed to load ApplicationContext
Caused by: java.lang.IllegalArgumentException: Cannot load an ApplicationContext with a NULL 'contextLoader'. Consider annotating your test class with @ContextConfiguration or @ContextHierarchy.
java.lang.IllegalStateException: Failed to load ApplicationContext
Caused by: java.lang.IllegalArgumentException: Cannot load an ApplicationContext with a NULL 'contextLoader'. Consider annotating your test class with @ContextConfiguration or @ContextHierarchy.
java.lang.IllegalStateException: Failed to load ApplicationContext
Caused by: java.lang.IllegalArgumentException: Cannot load an ApplicationContext with a NULL 'contextLoader'. Consider annotating your test class with @ContextConfiguration or @ContextHierarchy.
java.lang.IllegalStateException: Failed to load ApplicationContext
Caused by: java.lang.IllegalArgumentException: Cannot load an ApplicationContext with a NULL 'contextLoader'. Consider annotating your test class with @ContextConfiguration or @ContextHierarchy.
java.lang.IllegalStateException: Failed to load ApplicationContext
Caused by: java.lang.IllegalArgumentException: Cannot load an ApplicationContext with a NULL 'contextLoader'. Consider annotating your test class with @ContextConfiguration or @ContextHierarchy.
java.lang.IllegalStateException: Failed to load ApplicationContext
Caused by: java.lang.IllegalArgumentException: Cannot load an ApplicationContext with a NULL 'contextLoader'. Consider annotating your test class with @ContextConfiguration or @ContextHierarchy.
java.lang.IllegalStateException: Failed to load ApplicationContext
Caused by: java.lang.IllegalArgumentException: Cannot load an ApplicationContext with a NULL 'contextLoader'. Consider annotating your test class with @ContextConfiguration or @ContextHierarchy.
java.lang.IllegalStateException: Failed to load ApplicationContext
Caused by: java.lang.IllegalArgumentException: Cannot load an ApplicationContext with a NULL 'contextLoader'. Consider annotating your test class with @ContextConfiguration or @ContextHierarchy.
java.lang.IllegalStateException: Failed to load ApplicationContext
Caused by: java.lang.IllegalArgumentException: Cannot load an ApplicationContext with a NULL 'contextLoader'. Consider annotating your test class with @ContextConfiguration or @ContextHierarchy.
java.lang.IllegalStateException: Failed to load ApplicationContext
Caused by: java.lang.IllegalArgumentException: Cannot load an ApplicationContext with a NULL 'contextLoader'. Consider annotating your test class with @ContextConfiguration or @ContextHierarchy.
java.lang.IllegalStateException: Failed to load ApplicationContext
Caused by: java.lang.IllegalArgumentException: Cannot load an ApplicationContext with a NULL 'contextLoader'. Consider annotating your test class with @ContextConfiguration or @ContextHierarchy.
java.lang.IllegalStateException: Failed to load ApplicationContext
Caused by: java.lang.IllegalArgumentException: Cannot load an ApplicationContext with a NULL 'contextLoader'. Consider annotating your test class with @ContextConfiguration or @ContextHierarchy.
java.lang.IllegalStateException: Failed to load ApplicationContext
Caused by: java.lang.IllegalArgumentException: Cannot load an ApplicationContext with a NULL 'contextLoader'. Consider annotating your test class with @ContextConfiguration or @ContextHierarchy.
java.lang.IllegalStateException: Failed to load ApplicationContext
Caused by: java.lang.IllegalArgumentException: Cannot load an ApplicationContext with a NULL 'contextLoader'. Consider annotating your test class with @ContextConfiguration or @ContextHierarchy.
java.lang.IllegalStateException: Failed to load ApplicationContext
Caused by: java.lang.IllegalArgumentException: Cannot load an ApplicationContext with a NULL 'contextLoader'. Consider annotating your test class with @ContextConfiguration or @ContextHierarchy.
java.lang.IllegalStateException: Failed to load ApplicationContext
Caused by: java.lang.IllegalArgumentException: Cannot load an ApplicationContext with a NULL 'contextLoader'. Consider annotating your test class with @ContextConfiguration or @ContextHierarchy.
java.lang.IllegalStateException: Failed to load ApplicationContext
Caused by: java.lang.IllegalArgumentException: Cannot load an ApplicationContext with a NULL 'contextLoader'. Consider annotating your test class with @ContextConfiguration or @ContextHierarchy.
java.lang.IllegalStateException: Failed to load ApplicationContext
Caused by: java.lang.IllegalArgumentException: Cannot load an ApplicationContext with a NULL 'contextLoader'. Consider annotating your test class with @ContextConfiguration or @ContextHierarchy.
java.lang.IllegalStateException: Failed to load ApplicationContext
Caused by: java.lang.IllegalArgumentException: Cannot load an ApplicationContext with a NULL 'contextLoader'. Consider annotating your test class with @ContextConfiguration or @ContextHierarchy.
Fixed tests 2
Status Test Failing since View job Duration
Successful SFlowTelemetryAdapterIT verifyAdapter History
Failing since build #127 (Changes by Bamboo Administrator) Smoke Test (Flapping) 3 mins
Successful TopologyIT verifyNoVerticesFoundTextIsShown History
Failing since build #127 (Changes by Bamboo Administrator) Smoke Test (Flapping) 49 secs

Jira issues

IssueDescriptionStatus
Unknown Issue TypeNMS-10594Could not obtain issue details from Jira