Build #117

Build: #117 failed Changes by Jesse White

Build result summary

Details

Completed
Duration
359 minutes
Labels
None
Revisions
OpenNMS (develop branch)
4afecd31af01e19a1af59b40447568a5987b8f4a 4afecd31af01e19a1af59b40447568a5987b8f4a
OpenNMS Installer
da12784d9ab4ba4aacedec0283d0c04075fd6ebf da12784d9ab4ba4aacedec0283d0c04075fd6ebf
OpenNMS-Repo
088d710674109759251f42c6720d74ea80cf3f13 088d710674109759251f42c6720d74ea80cf3f13
Smoke Tests
cb1e72265cf2ce10cb4872f58120272b340a1ce1 cb1e72265cf2ce10cb4872f58120272b340a1ce1
OpenNMS Bamboo Utils
0a62053bc90f6ffcce1e17256674b2dae7b4f8a3 0a62053bc90f6ffcce1e17256674b2dae7b4f8a3
OpenNMS System Test API
2f3a985377db43ce9b451390b9744bac402ffbd7 2f3a985377db43ce9b451390b9744bac402ffbd7
Total tests
2389
Failing since
#27 (Changes by mvrueden <mvrueden@users.noreply.github.com> and Jesse White)

Responsible

Code commits

OpenNMS (develop branch)
Author Commit Message Commit date
Jesse White Jesse White 4afecd31af01e19a1af59b40447568a5987b8f4a 4afecd31af01e19a1af59b40447568a5987b8f4a Merge remote-tracking branch 'origin/release-24.0.0' into develop
Jesse White Jesse White a2e7e3bb9b1426b840beafeb0cd1764ee3852093 m a2e7e3bb9b1426b840beafeb0cd1764ee3852093 Revert "Merge pull request #2399 from OpenNMS/jira/HZN-1478"
This reverts commit cfc50b1ed14628eefaa5d756f7f67f79315f3b7a, reversing
changes made to 04a67c228133ded48790f7cc6e3ec92cc620fdb9.
Jesse White Jesse White be6894b96c14707493783edf0bd7d645f8b21a97 m be6894b96c14707493783edf0bd7d645f8b21a97 Merge remote-tracking branch 'origin/release-24.0.0' into jira/HZN-1498
Benjamin Reed Benjamin Reed f905ea703f586552927d209a6aa6f26180bd33d3 m f905ea703f586552927d209a6aa6f26180bd33d3 Merge remote-tracking branch 'origin/release-23.0.4' into release-24.0.0
Jesse White Jesse White 449d4ec4fc5ddd047c7c994005fef57cef8973c6 m 449d4ec4fc5ddd047c7c994005fef57cef8973c6 HZN-1498: Add missing test dependencies.

Tests

New test failures 2
Status Test View job Duration
Collapse Failed SinkBlueprintMessageFailureIT org.opennms.core.ipc.sink.camel.itests.SinkBlueprintMessageFailureIT History
Integration Test (Flapping) 3 secs
java.lang.Exception: ActiveMQ broker was not started or stopped unexpectedly. Error: org.apache.activemq.broker.BrokerStoppedException: Stop invoked
	at org.opennms.core.test.activemq.ActiveMQBroker.before(ActiveMQBroker.java:56)
	at org.junit.rules.ExternalResource$1.evaluate(ExternalResource.java:46)
	at org.junit.rules.RunRules.evaluate(RunRules.java:20)
	at org.junit.runners.ParentRunner.run(ParentRunner.java:363)
	at org.springframework.test.context.junit4.SpringJUnit4ClassRunner.run(SpringJUnit4ClassRunner.java:193)
	at org.apache.maven.surefire.junit4.JUnit4Provider.execute(JUnit4Provider.java:275)
	at org.apache.maven.surefire.junit4.JUnit4Provider.executeWithRerun(JUnit4Provider.java:183)
(5 more lines...)
Collapse Failed SinkBlueprintMessageFailureIT doesntLogMessageBody History
Integration Test (Flapping) 3 secs
java.lang.AssertionError: null
	at org.junit.Assert.fail(Assert.java:86)
	at org.junit.Assert.assertTrue(Assert.java:41)
	at org.junit.Assert.assertNotNull(Assert.java:712)
	at org.junit.Assert.assertNotNull(Assert.java:722)
	at org.opennms.core.ipc.sink.camel.itests.SinkBlueprintMessageFailureIT.doesntLogMessageBody(SinkBlueprintMessageFailureIT.java:141)
Existing test failures 22
Status Test Failing since View job Duration
java.lang.IllegalStateException: Failed to load ApplicationContext
Caused by: java.lang.IllegalArgumentException: Cannot load an ApplicationContext with a NULL 'contextLoader'. Consider annotating your test class with @ContextConfiguration or @ContextHierarchy.
java.lang.IllegalStateException: Failed to load ApplicationContext
Caused by: java.lang.IllegalArgumentException: Cannot load an ApplicationContext with a NULL 'contextLoader'. Consider annotating your test class with @ContextConfiguration or @ContextHierarchy.
java.lang.IllegalStateException: Failed to load ApplicationContext
Caused by: java.lang.IllegalArgumentException: Cannot load an ApplicationContext with a NULL 'contextLoader'. Consider annotating your test class with @ContextConfiguration or @ContextHierarchy.
java.lang.IllegalStateException: Failed to load ApplicationContext
Caused by: java.lang.IllegalArgumentException: Cannot load an ApplicationContext with a NULL 'contextLoader'. Consider annotating your test class with @ContextConfiguration or @ContextHierarchy.
java.lang.IllegalStateException: Failed to load ApplicationContext
Caused by: java.lang.IllegalArgumentException: Cannot load an ApplicationContext with a NULL 'contextLoader'. Consider annotating your test class with @ContextConfiguration or @ContextHierarchy.
java.lang.IllegalStateException: Failed to load ApplicationContext
Caused by: java.lang.IllegalArgumentException: Cannot load an ApplicationContext with a NULL 'contextLoader'. Consider annotating your test class with @ContextConfiguration or @ContextHierarchy.
java.lang.IllegalStateException: Failed to load ApplicationContext
Caused by: java.lang.IllegalArgumentException: Cannot load an ApplicationContext with a NULL 'contextLoader'. Consider annotating your test class with @ContextConfiguration or @ContextHierarchy.
java.lang.IllegalStateException: Failed to load ApplicationContext
Caused by: java.lang.IllegalArgumentException: Cannot load an ApplicationContext with a NULL 'contextLoader'. Consider annotating your test class with @ContextConfiguration or @ContextHierarchy.
java.lang.IllegalStateException: Failed to load ApplicationContext
Caused by: java.lang.IllegalArgumentException: Cannot load an ApplicationContext with a NULL 'contextLoader'. Consider annotating your test class with @ContextConfiguration or @ContextHierarchy.
java.lang.IllegalStateException: Failed to load ApplicationContext
Caused by: java.lang.IllegalArgumentException: Cannot load an ApplicationContext with a NULL 'contextLoader'. Consider annotating your test class with @ContextConfiguration or @ContextHierarchy.
java.lang.IllegalStateException: Failed to load ApplicationContext
Caused by: java.lang.IllegalArgumentException: Cannot load an ApplicationContext with a NULL 'contextLoader'. Consider annotating your test class with @ContextConfiguration or @ContextHierarchy.
java.lang.IllegalStateException: Failed to load ApplicationContext
Caused by: java.lang.IllegalArgumentException: Cannot load an ApplicationContext with a NULL 'contextLoader'. Consider annotating your test class with @ContextConfiguration or @ContextHierarchy.
java.lang.IllegalStateException: Failed to load ApplicationContext
Caused by: java.lang.IllegalArgumentException: Cannot load an ApplicationContext with a NULL 'contextLoader'. Consider annotating your test class with @ContextConfiguration or @ContextHierarchy.
java.lang.IllegalStateException: Failed to load ApplicationContext
Caused by: java.lang.IllegalArgumentException: Cannot load an ApplicationContext with a NULL 'contextLoader'. Consider annotating your test class with @ContextConfiguration or @ContextHierarchy.
java.lang.IllegalStateException: Failed to load ApplicationContext
Caused by: java.lang.IllegalArgumentException: Cannot load an ApplicationContext with a NULL 'contextLoader'. Consider annotating your test class with @ContextConfiguration or @ContextHierarchy.
java.lang.IllegalStateException: Failed to load ApplicationContext
Caused by: java.lang.IllegalArgumentException: Cannot load an ApplicationContext with a NULL 'contextLoader'. Consider annotating your test class with @ContextConfiguration or @ContextHierarchy.
java.lang.IllegalStateException: Failed to load ApplicationContext
Caused by: java.lang.IllegalArgumentException: Cannot load an ApplicationContext with a NULL 'contextLoader'. Consider annotating your test class with @ContextConfiguration or @ContextHierarchy.
java.lang.IllegalStateException: Failed to load ApplicationContext
Caused by: java.lang.IllegalArgumentException: Cannot load an ApplicationContext with a NULL 'contextLoader'. Consider annotating your test class with @ContextConfiguration or @ContextHierarchy.
java.lang.IllegalStateException: Failed to load ApplicationContext
Caused by: java.lang.IllegalArgumentException: Cannot load an ApplicationContext with a NULL 'contextLoader'. Consider annotating your test class with @ContextConfiguration or @ContextHierarchy.
java.lang.IllegalStateException: Failed to load ApplicationContext
Caused by: java.lang.IllegalArgumentException: Cannot load an ApplicationContext with a NULL 'contextLoader'. Consider annotating your test class with @ContextConfiguration or @ContextHierarchy.
com.jayway.awaitility.core.ConditionTimeoutException: Condition with lambda expression in org.opennms.smoketest.telemetry.FlowTester that uses org.opennms.smoketest.telemetry.FlowTester$Block was not fulfilled within 1 minutes.
	at org.opennms.smoketest.flow.FlowStackIT.verifyFlowStack(FlowStackIT.java:98)
org.openqa.selenium.NoSuchElementException: Unable to locate element: {"method":"xpath","selector":"//*/table[@class='search-token-field']//div[@class='search-token-label' and contains(text(),'Node-3')]"}
Command duration or timeout: 1.09 seconds
For documentation on this error, please visit: http://seleniumhq.org/exceptions/no_such_element.html
Build info: version: '2.53.1', revision: 'a36b8b1cd5757287168e54b817830adce9b0158d', time: '2016-06-30 19:26:09'
System info: host: 'cmu.internal.opennms.com', ip: '172.20.1.203', os.name: 'Linux', os.arch: 'amd64', os.version: '4.18.0-16-generic', java.version: '1.8.0_201'
Driver info: org.openqa.selenium.firefox.FirefoxDriver
Capabilities [{applicationCacheEnabled=true, rotatable=false, handlesAlerts=true, databaseEnabled=true, version=45.0.2, platform=LINUX, nativeEvents=false, acceptSslCerts=true, webStorageEnabled=true, locationContextEnabled=true, browserName=firefox, takesScreenshot=true, javascriptEnabled=true, cssSelectorsEnabled=true}]
Session ID: c0ae59e8-b694-4e4b-b38d-4e9114110187
(18 more lines...)
Fixed tests 84
Status Test Failing since View job Duration
Successful HeartbeatSinkBlueprintIT canConsumeMessagesInParallel History
Failing since build #116 (Changes by Bamboo Administrator) Integration Test (Flapping) 7 secs
Successful HeartbeatSinkPerfIT quickRun History
Failing since build #116 (Changes by Bamboo Administrator) Integration Test (Flapping) 3 secs
Successful AdminPageIT testAllTextIsPresent History
Failing since build #116 (Changes by Bamboo Administrator) Smoke Test (Flapping) 12 secs
Successful AdminPageIT testAllLinks History
Failing since build #116 (Changes by Bamboo Administrator) Smoke Test (Flapping) 44 secs
Successful AlarmElasticsearch5IT canForwardAlarmToEs History
Failing since build #116 (Changes by Bamboo Administrator) Smoke Test (Flapping) 15 secs
Successful ClassificationRulePageIT verifyReadOnlyGroup History
Failing since build #116 (Changes by Bamboo Administrator) Smoke Test (Flapping) 42 secs
Successful ClassificationRulePageIT verifyTabs History
Failing since build #116 (Changes by Bamboo Administrator) Smoke Test (Flapping) 28 secs
Successful ClassificationRulePageIT verifyRulePaginationAndDeleteAll History
Failing since build #116 (Changes by Bamboo Administrator) Smoke Test (Flapping) 3 mins
Successful ClassificationRulePageIT verifyClassification History
Failing since build #116 (Changes by Bamboo Administrator) Smoke Test (Flapping) 25 secs
Successful ClassificationRulePageIT verifySettingsTab History
Failing since build #116 (Changes by Bamboo Administrator) Smoke Test (Flapping) 43 secs
Successful ClassificationRulePageIT verifySearch History
Failing since build #116 (Changes by Bamboo Administrator) Smoke Test (Flapping) 24 secs
Successful ClassificationRulePageIT verifyRuleCRUD History
Failing since build #116 (Changes by Bamboo Administrator) Smoke Test (Flapping) 31 secs
Successful ClassificationRulePageIT verifyErrorMessageReset History
Failing since build #116 (Changes by Bamboo Administrator) Smoke Test (Flapping) 25 secs
Successful ClassificationRulePageIT verifyExporterFilter History
Failing since build #116 (Changes by Bamboo Administrator) Smoke Test (Flapping) 34 secs
Successful ClassificationRulePageIT verifySrcValues History
Failing since build #116 (Changes by Bamboo Administrator) Smoke Test (Flapping) 31 secs
Successful ClassificationRestIT verifyCRUD History
Failing since build #116 (Changes by Bamboo Administrator) Smoke Test (Flapping) 13 secs
Successful ClassificationRestIT verifyDeleteNonExisting History
Failing since build #116 (Changes by Bamboo Administrator) Smoke Test (Flapping) 12 secs
Successful ClassificationRestIT verifyGetNonExisting History
Failing since build #116 (Changes by Bamboo Administrator) Smoke Test (Flapping) 12 secs
Successful ClassificationRestIT verifyUpdateNonExisting History
Failing since build #116 (Changes by Bamboo Administrator) Smoke Test (Flapping) 17 secs
Successful ClassificationRestIT verifyImport History
Failing since build #116 (Changes by Bamboo Administrator) Smoke Test (Flapping) 12 secs
Successful ClassificationRestIT verifyClassify History
Failing since build #116 (Changes by Bamboo Administrator) Smoke Test (Flapping) 12 secs
Successful ClassificationRestIT verifyProtocols History
Failing since build #116 (Changes by Bamboo Administrator) Smoke Test (Flapping) 12 secs
Successful ClassificationRestIT verifyExportGroup History
Failing since build #116 (Changes by Bamboo Administrator) Smoke Test (Flapping) 12 secs
Successful ClassificationRestIT verifyDisableGroup History
Failing since build #116 (Changes by Bamboo Administrator) Smoke Test (Flapping) 12 secs
Successful ClassificationRestIT verifyCreateNull History
Failing since build #116 (Changes by Bamboo Administrator) Smoke Test (Flapping) 12 secs
Successful ClassificationRestIT verifyClassifyEmpty History
Failing since build #116 (Changes by Bamboo Administrator) Smoke Test (Flapping) 12 secs
Successful SinglePortFlowsIT verifyFlowStack History
Failing since build #116 (Changes by Bamboo Administrator) Smoke Test (Flapping) 2 mins
Successful HealthCheckIT verifyOpenNMSHealth History
Failing since build #116 (Changes by Bamboo Administrator) Smoke Test (Flapping) 10 secs
Successful IndexPageIT verifyStatusMap History
Failing since build #116 (Changes by Bamboo Administrator) Smoke Test (Flapping) 42 secs
Successful IntegrationAPIIT canLoadSampleProject History
Failing since build #116 (Changes by Bamboo Administrator) Smoke Test (Flapping) 10 secs
Successful JmxConfigurationGeneratorIT testNavigation History
Failing since build #116 (Changes by Bamboo Administrator) Smoke Test (Flapping) 26 secs
Successful JmxConfigurationGeneratorIT testClickOnHeaderLinkWorks History
Failing since build #116 (Changes by Bamboo Administrator) Smoke Test (Flapping) 18 secs
Successful JmxConfigurationGeneratorIT verifyCompMemberSelection History
Failing since build #116 (Changes by Bamboo Administrator) Smoke Test (Flapping) 25 secs
Successful KafkaPersisterIT testKafkaPersisterForMetrics History
Failing since build #116 (Changes by Bamboo Administrator) Smoke Test (Flapping) 51 secs
Successful KafkaProducerIT testKafkaAlarmStoreData History
Failing since build #116 (Changes by Bamboo Administrator) Smoke Test (Flapping) 36 secs
Successful KafkaProducerIT testKafkaPersisterForMetrics History
Failing since build #116 (Changes by Bamboo Administrator) Smoke Test (Flapping) 47 secs
Successful MenuHeaderIT testMenuEntries History
Failing since build #116 (Changes by Bamboo Administrator) Smoke Test (Flapping) 40 secs
Successful CollectorListIT canLoadCollectorsOnOpenNMS History
Failing since build #116 (Changes by Bamboo Administrator) Smoke Test (Flapping) < 1 sec
Successful DetectorsCommandIT canLoadDetectorsOnOpenNMS History
Failing since build #116 (Changes by Bamboo Administrator) Smoke Test (Flapping) < 1 sec
Successful JMXCollectorIT canPerformAdhocJmxCollection History
Failing since build #116 (Changes by Bamboo Administrator) Smoke Test (Flapping) < 1 sec
Successful JtiTelemetryIT verifyJtiTelemetryOnOpenNMS History
Failing since build #116 (Changes by Bamboo Administrator) Smoke Test (Flapping) 20 secs
Successful JtiTelemetryIT verifyJtiTelemetryOnMinion History
Failing since build #116 (Changes by Bamboo Administrator) Smoke Test (Flapping) 30 secs
Successful MonitorsListCommandIT canLoadMonitorsOnOpenNMS History
Failing since build #116 (Changes by Bamboo Administrator) Smoke Test (Flapping) < 1 sec
Successful NxosTelemetryIT verifyNxosTelemetryOnMinion History
Failing since build #116 (Changes by Bamboo Administrator) Smoke Test (Flapping) 45 secs
Successful NxosTelemetryIT verifyNxosTelemetryOnOpenNMS History
Failing since build #116 (Changes by Bamboo Administrator) Smoke Test (Flapping) 35 secs
Successful RpcOverKafkaIT verifyKafkaRpcWithIcmpServiceDetection History
Failing since build #115 (Changes by Bamboo Administrator) Smoke Test (Flapping) 15 secs
Successful RpcOverKafkaIT verifyKafkaRpcWithJdbcServiceDetection History
Failing since build #115 (Changes by Bamboo Administrator) Smoke Test (Flapping) < 1 sec
Successful SyslogKafkaElasticsearch5IT testMinionSyslogsOverKafkaToEsRest History
Failing since build #116 (Changes by Bamboo Administrator) Smoke Test (Flapping) 4 mins
Successful SyslogKafkaElasticsearch5OutageIT testMinionSyslogsOverKafkaToEsRest History
Failing since build #116 (Changes by Bamboo Administrator) Smoke Test (Flapping) 4 mins
Successful SyslogKafkaElasticsearch6IT testMinionSyslogsOverKafkaToEsRest History
Failing since build #116 (Changes by Bamboo Administrator) Smoke Test (Flapping) 4 mins

Jira issues

IssueDescriptionStatus
Unknown Issue TypeHZN-1478Could not obtain issue details from Jira
Unknown Issue TypeHZN-1498Could not obtain issue details from Jira
Unknown Issue TypeHZN-1499Could not obtain issue details from Jira
Unknown Issue TypeNMS-10593Could not obtain issue details from Jira
Unknown Issue TypeNMS-10606Could not obtain issue details from Jira