Build #107

Build: #107 failed Changes by Bamboo Administrator

Build result summary

Details

Completed
Duration
337 minutes
Labels
None
Revisions
OpenNMS (develop branch)
29e3981ea7ba3d2e78f97c048c8d44af240513d9 29e3981ea7ba3d2e78f97c048c8d44af240513d9
OpenNMS Installer
da12784d9ab4ba4aacedec0283d0c04075fd6ebf da12784d9ab4ba4aacedec0283d0c04075fd6ebf
OpenNMS-Repo
088d710674109759251f42c6720d74ea80cf3f13 088d710674109759251f42c6720d74ea80cf3f13
Smoke Tests
cb1e72265cf2ce10cb4872f58120272b340a1ce1 cb1e72265cf2ce10cb4872f58120272b340a1ce1
OpenNMS Bamboo Utils
0a62053bc90f6ffcce1e17256674b2dae7b4f8a3 0a62053bc90f6ffcce1e17256674b2dae7b4f8a3
OpenNMS System Test API
2f3a985377db43ce9b451390b9744bac402ffbd7 2f3a985377db43ce9b451390b9744bac402ffbd7
Total tests
4902
Failing since
#27 (Changes by mvrueden <mvrueden@users.noreply.github.com> and Jesse White)

Responsible

Code commits

OpenNMS (develop branch)
Author Commit Message Commit date
Bamboo Administrator Bamboo Administrator 29e3981ea7ba3d2e78f97c048c8d44af240513d9 29e3981ea7ba3d2e78f97c048c8d44af240513d9 [bamboo] Automated branch merge (from release-24.0.0:c6c333450cb8d09f5c55f9837b14ffb2e23e451d)
Chandra Gorantla <chandra@opennms.com> Chandra Gorantla <chandra@opennms.com> c6c333450cb8d09f5c55f9837b14ffb2e23e451d m c6c333450cb8d09f5c55f9837b14ffb2e23e451d Merge pull request #2363 from OpenNMS/jira/OIA-3
OIA-3: Map SNMP datacollection configuration from integration API
Chandra Gorantla <chandra@opennms.com> Chandra Gorantla <chandra@opennms.com> ac4f4ac38bf3f899e2bbd1e15af90a6f8f46c2b8 m ac4f4ac38bf3f899e2bbd1e15af90a6f8f46c2b8 OIA-3: Fix test
Chandra Gorantla <chandra@opennms.com> Chandra Gorantla <chandra@opennms.com> b5c872f9d3751be82c402383d696780eafd87e4c m b5c872f9d3751be82c402383d696780eafd87e4c OIA-3: Refactor getPrefabGraph
Chandra Gorantla <chandra@opennms.com> Chandra Gorantla <chandra@opennms.com> cf342a2e1e43b691e0d4fa2f1147679c2eaf9948 m cf342a2e1e43b691e0d4fa2f1147679c2eaf9948 Merge branch 'release-24.0.0' into jira/OIA-3

Tests

New test failures 3
Status Test View job Duration
Collapse Failed AMQPEventForwarderBlueprintTest canForwardEvent History
Integration Test (Flapping) < 1 sec
java.lang.IllegalStateException: Failed to load ApplicationContext
	at org.springframework.test.context.cache.DefaultCacheAwareContextLoaderDelegate.loadContext(DefaultCacheAwareContextLoaderDelegate.java:124)
	at org.springframework.test.context.support.DefaultTestContext.getApplicationContext(DefaultTestContext.java:83)
	at org.springframework.test.context.support.DependencyInjectionTestExecutionListener.injectDependencies(DependencyInjectionTestExecutionListener.java:117)
	at org.springframework.test.context.support.DependencyInjectionTestExecutionListener.prepareTestInstance(DependencyInjectionTestExecutionListener.java:83)
	at org.springframework.test.context.TestContextManager.prepareTestInstance(TestContextManager.java:228)
	at org.springframework.test.context.junit4.SpringJUnit4ClassRunner.createTest(SpringJUnit4ClassRunner.java:230)
	at org.springframework.test.context.junit4.SpringJUnit4ClassRunner$1.runReflectiveCall(SpringJUnit4ClassRunner.java:289)
(52 more lines...)
Collapse Failed ChooseResourcesPageIT verifyGraphAll History
Smoke Test (Flapping) 4 mins
org.opennms.smoketest.OpenNMSTestException: org.opennms.smoketest.OpenNMSTestException: org.openqa.selenium.TimeoutException: Timed out after 240 seconds waiting for org.opennms.smoketest.OpenNMSSeleniumTestCase$WaitForNodesInDatabase@13916481
Build info: version: '2.53.1', revision: 'a36b8b1cd5757287168e54b817830adce9b0158d', time: '2016-06-30 19:26:09'
System info: host: 'bambooagent05.internal.opennms.com', ip: '172.20.1.209', os.name: 'Linux', os.arch: 'amd64', os.version: '4.15.0-46-generic', java.version: '1.8.0_201'
Driver info: org.openqa.selenium.firefox.FirefoxDriver
Capabilities [{applicationCacheEnabled=true, rotatable=false, handlesAlerts=true, databaseEnabled=true, version=45.0.2, platform=LINUX, nativeEvents=false, acceptSslCerts=true, webStorageEnabled=true, locationContextEnabled=true, browserName=firefox, takesScreenshot=true, javascriptEnabled=true, cssSelectorsEnabled=true}]
Session ID: b4ca85a6-020a-48f4-acf7-2d6b945ba58d
org.opennms.smoketest.OpenNMSTestException: 
org.opennms.smoketest.OpenNMSTestException: org.openqa.selenium.TimeoutException: Timed out after 240 seconds waiting for org.opennms.smoketest.OpenNMSSeleniumTestCase$WaitForNodesInDatabase@13916481
(22 more lines...)
Collapse Failed EditInRequisitionIT testIfDeployed History
Smoke Test (Flapping) 19 secs
org.junit.ComparisonFailure: expected:<Node [my-node-1 ]at SeleniumTestGroup> but was:<Node []at SeleniumTestGroup>
	at org.opennms.smoketest.EditInRequisitionIT.testIfDeployed(EditInRequisitionIT.java:84)
Existing test failures 20
Status Test Failing since View job Duration
java.lang.IllegalStateException: Failed to load ApplicationContext
Caused by: java.lang.IllegalArgumentException: Cannot load an ApplicationContext with a NULL 'contextLoader'. Consider annotating your test class with @ContextConfiguration or @ContextHierarchy.
java.lang.IllegalStateException: Failed to load ApplicationContext
Caused by: java.lang.IllegalArgumentException: Cannot load an ApplicationContext with a NULL 'contextLoader'. Consider annotating your test class with @ContextConfiguration or @ContextHierarchy.
java.lang.IllegalStateException: Failed to load ApplicationContext
Caused by: java.lang.IllegalArgumentException: Cannot load an ApplicationContext with a NULL 'contextLoader'. Consider annotating your test class with @ContextConfiguration or @ContextHierarchy.
java.lang.IllegalStateException: Failed to load ApplicationContext
Caused by: java.lang.IllegalArgumentException: Cannot load an ApplicationContext with a NULL 'contextLoader'. Consider annotating your test class with @ContextConfiguration or @ContextHierarchy.
java.lang.IllegalStateException: Failed to load ApplicationContext
Caused by: java.lang.IllegalArgumentException: Cannot load an ApplicationContext with a NULL 'contextLoader'. Consider annotating your test class with @ContextConfiguration or @ContextHierarchy.
java.lang.IllegalStateException: Failed to load ApplicationContext
Caused by: java.lang.IllegalArgumentException: Cannot load an ApplicationContext with a NULL 'contextLoader'. Consider annotating your test class with @ContextConfiguration or @ContextHierarchy.
java.lang.IllegalStateException: Failed to load ApplicationContext
Caused by: java.lang.IllegalArgumentException: Cannot load an ApplicationContext with a NULL 'contextLoader'. Consider annotating your test class with @ContextConfiguration or @ContextHierarchy.
java.lang.IllegalStateException: Failed to load ApplicationContext
Caused by: java.lang.IllegalArgumentException: Cannot load an ApplicationContext with a NULL 'contextLoader'. Consider annotating your test class with @ContextConfiguration or @ContextHierarchy.
java.lang.IllegalStateException: Failed to load ApplicationContext
Caused by: java.lang.IllegalArgumentException: Cannot load an ApplicationContext with a NULL 'contextLoader'. Consider annotating your test class with @ContextConfiguration or @ContextHierarchy.
java.lang.IllegalStateException: Failed to load ApplicationContext
Caused by: java.lang.IllegalArgumentException: Cannot load an ApplicationContext with a NULL 'contextLoader'. Consider annotating your test class with @ContextConfiguration or @ContextHierarchy.
java.lang.IllegalStateException: Failed to load ApplicationContext
Caused by: java.lang.IllegalArgumentException: Cannot load an ApplicationContext with a NULL 'contextLoader'. Consider annotating your test class with @ContextConfiguration or @ContextHierarchy.
java.lang.IllegalStateException: Failed to load ApplicationContext
Caused by: java.lang.IllegalArgumentException: Cannot load an ApplicationContext with a NULL 'contextLoader'. Consider annotating your test class with @ContextConfiguration or @ContextHierarchy.
java.lang.IllegalStateException: Failed to load ApplicationContext
Caused by: java.lang.IllegalArgumentException: Cannot load an ApplicationContext with a NULL 'contextLoader'. Consider annotating your test class with @ContextConfiguration or @ContextHierarchy.
java.lang.IllegalStateException: Failed to load ApplicationContext
Caused by: java.lang.IllegalArgumentException: Cannot load an ApplicationContext with a NULL 'contextLoader'. Consider annotating your test class with @ContextConfiguration or @ContextHierarchy.
java.lang.IllegalStateException: Failed to load ApplicationContext
Caused by: java.lang.IllegalArgumentException: Cannot load an ApplicationContext with a NULL 'contextLoader'. Consider annotating your test class with @ContextConfiguration or @ContextHierarchy.
java.lang.IllegalStateException: Failed to load ApplicationContext
Caused by: java.lang.IllegalArgumentException: Cannot load an ApplicationContext with a NULL 'contextLoader'. Consider annotating your test class with @ContextConfiguration or @ContextHierarchy.
java.lang.IllegalStateException: Failed to load ApplicationContext
Caused by: java.lang.IllegalArgumentException: Cannot load an ApplicationContext with a NULL 'contextLoader'. Consider annotating your test class with @ContextConfiguration or @ContextHierarchy.
java.lang.IllegalStateException: Failed to load ApplicationContext
Caused by: java.lang.IllegalArgumentException: Cannot load an ApplicationContext with a NULL 'contextLoader'. Consider annotating your test class with @ContextConfiguration or @ContextHierarchy.
java.lang.IllegalStateException: Failed to load ApplicationContext
Caused by: java.lang.IllegalArgumentException: Cannot load an ApplicationContext with a NULL 'contextLoader'. Consider annotating your test class with @ContextConfiguration or @ContextHierarchy.
java.lang.IllegalStateException: Failed to load ApplicationContext
Caused by: java.lang.IllegalArgumentException: Cannot load an ApplicationContext with a NULL 'contextLoader'. Consider annotating your test class with @ContextConfiguration or @ContextHierarchy.
Fixed tests 4
Status Test Failing since View job Duration
Successful HeartbeatSinkBlueprintIT canConsumeMessagesInParallel History
Failing since build #106 (Changes by Bamboo Administrator) Integration Test (Flapping) 7 secs
Successful XRequestedWithRestIT verifyWWWAuthenticate History
Failing since build #105 (Changes by Bamboo Administrator) Smoke Test (Flapping) 13 secs
Successful NxosTelemetryAdapterIT verifyAdapter History
Failing since build #106 (Changes by Bamboo Administrator) Smoke Test (Flapping) 3 mins
Successful TopologyIT verifyNoVerticesFoundTextIsShown History
Failing since build #106 (Changes by Bamboo Administrator) Smoke Test (Flapping) 45 secs

Jira issues

IssueDescriptionStatus
Unknown Issue TypeOIA-3Could not obtain issue details from Jira