Build #106

Build: #106 failed Changes by Bamboo Administrator

Test results

  • 2,373 tests in total
  • 25 tests failed
  • 4 failures are new
  • 1 test was fixed
  • 46 tests were quarantined / skipped
  • 196 minutes taken in total.
New test failures 4
Status Test View job Duration
Collapse Failed HeartbeatSinkBlueprintIT org.opennms.core.ipc.sink.camel.itests.HeartbeatSinkBlueprintIT History
Integration Test (Flapping) 2 secs
java.lang.Exception: ActiveMQ broker was not started or stopped unexpectedly. Error: org.apache.activemq.broker.BrokerStoppedException: Stop invoked
	at org.opennms.core.test.activemq.ActiveMQBroker.before(ActiveMQBroker.java:56)
	at org.junit.rules.ExternalResource$1.evaluate(ExternalResource.java:46)
	at org.junit.rules.RunRules.evaluate(RunRules.java:20)
	at org.junit.runners.ParentRunner.run(ParentRunner.java:363)
	at org.springframework.test.context.junit4.SpringJUnit4ClassRunner.run(SpringJUnit4ClassRunner.java:193)
	at org.apache.maven.surefire.junit4.JUnit4Provider.execute(JUnit4Provider.java:275)
	at org.apache.maven.surefire.junit4.JUnit4Provider.executeWithRerun(JUnit4Provider.java:183)
(5 more lines...)
Collapse Failed HeartbeatSinkBlueprintIT canConsumeMessagesInParallel History
Integration Test (Flapping) 2 secs
java.lang.NullPointerException: null
	at org.opennms.core.ipc.sink.camel.itests.HeartbeatSinkBlueprintIT.canConsumeMessagesInParallel(HeartbeatSinkBlueprintIT.java:171)
Collapse Failed NxosTelemetryAdapterIT verifyAdapter History
Smoke Test (Flapping) 7 mins
com.jayway.awaitility.core.ConditionTimeoutException: Condition with lambda expression in org.opennms.test.system.api.NewTestEnvironment was not fulfilled within 5 minutes.
Collapse Failed TopologyIT verifyNoVerticesFoundTextIsShown History
Smoke Test (Flapping) 36 secs
org.openqa.selenium.NoSuchElementException: Unable to locate element: {"method":"xpath","selector":"//*/table[@class='search-token-field']//div[@class='search-token-label' and contains(text(),'Node-3')]"}
Command duration or timeout: 1.07 seconds
For documentation on this error, please visit: http://seleniumhq.org/exceptions/no_such_element.html
Build info: version: '2.53.1', revision: 'a36b8b1cd5757287168e54b817830adce9b0158d', time: '2016-06-30 19:26:09'
System info: host: 'ncstate.internal.opennms.com', ip: '172.20.1.201', os.name: 'Linux', os.arch: 'amd64', os.version: '4.18.0-16-generic', java.version: '1.8.0_201'
Driver info: org.openqa.selenium.firefox.FirefoxDriver
Capabilities [{applicationCacheEnabled=true, rotatable=false, handlesAlerts=true, databaseEnabled=true, version=45.0.2, platform=LINUX, nativeEvents=false, acceptSslCerts=true, webStorageEnabled=true, locationContextEnabled=true, browserName=firefox, takesScreenshot=true, javascriptEnabled=true, cssSelectorsEnabled=true}]
Session ID: f3a2c116-6f34-455d-9f1b-a21a4251e85e
(18 more lines...)
Existing test failures 21
Status Test Failing since View job Duration
java.lang.IllegalStateException: Failed to load ApplicationContext
Caused by: java.lang.IllegalArgumentException: Cannot load an ApplicationContext with a NULL 'contextLoader'. Consider annotating your test class with @ContextConfiguration or @ContextHierarchy.
java.lang.IllegalStateException: Failed to load ApplicationContext
Caused by: java.lang.IllegalArgumentException: Cannot load an ApplicationContext with a NULL 'contextLoader'. Consider annotating your test class with @ContextConfiguration or @ContextHierarchy.
java.lang.IllegalStateException: Failed to load ApplicationContext
Caused by: java.lang.IllegalArgumentException: Cannot load an ApplicationContext with a NULL 'contextLoader'. Consider annotating your test class with @ContextConfiguration or @ContextHierarchy.
java.lang.IllegalStateException: Failed to load ApplicationContext
Caused by: java.lang.IllegalArgumentException: Cannot load an ApplicationContext with a NULL 'contextLoader'. Consider annotating your test class with @ContextConfiguration or @ContextHierarchy.
java.lang.IllegalStateException: Failed to load ApplicationContext
Caused by: java.lang.IllegalArgumentException: Cannot load an ApplicationContext with a NULL 'contextLoader'. Consider annotating your test class with @ContextConfiguration or @ContextHierarchy.
java.lang.IllegalStateException: Failed to load ApplicationContext
Caused by: java.lang.IllegalArgumentException: Cannot load an ApplicationContext with a NULL 'contextLoader'. Consider annotating your test class with @ContextConfiguration or @ContextHierarchy.
java.lang.IllegalStateException: Failed to load ApplicationContext
Caused by: java.lang.IllegalArgumentException: Cannot load an ApplicationContext with a NULL 'contextLoader'. Consider annotating your test class with @ContextConfiguration or @ContextHierarchy.
java.lang.IllegalStateException: Failed to load ApplicationContext
Caused by: java.lang.IllegalArgumentException: Cannot load an ApplicationContext with a NULL 'contextLoader'. Consider annotating your test class with @ContextConfiguration or @ContextHierarchy.
java.lang.IllegalStateException: Failed to load ApplicationContext
Caused by: java.lang.IllegalArgumentException: Cannot load an ApplicationContext with a NULL 'contextLoader'. Consider annotating your test class with @ContextConfiguration or @ContextHierarchy.
java.lang.IllegalStateException: Failed to load ApplicationContext
Caused by: java.lang.IllegalArgumentException: Cannot load an ApplicationContext with a NULL 'contextLoader'. Consider annotating your test class with @ContextConfiguration or @ContextHierarchy.
java.lang.IllegalStateException: Failed to load ApplicationContext
Caused by: java.lang.IllegalArgumentException: Cannot load an ApplicationContext with a NULL 'contextLoader'. Consider annotating your test class with @ContextConfiguration or @ContextHierarchy.
java.lang.IllegalStateException: Failed to load ApplicationContext
Caused by: java.lang.IllegalArgumentException: Cannot load an ApplicationContext with a NULL 'contextLoader'. Consider annotating your test class with @ContextConfiguration or @ContextHierarchy.
java.lang.IllegalStateException: Failed to load ApplicationContext
Caused by: java.lang.IllegalArgumentException: Cannot load an ApplicationContext with a NULL 'contextLoader'. Consider annotating your test class with @ContextConfiguration or @ContextHierarchy.
java.lang.IllegalStateException: Failed to load ApplicationContext
Caused by: java.lang.IllegalArgumentException: Cannot load an ApplicationContext with a NULL 'contextLoader'. Consider annotating your test class with @ContextConfiguration or @ContextHierarchy.
java.lang.IllegalStateException: Failed to load ApplicationContext
Caused by: java.lang.IllegalArgumentException: Cannot load an ApplicationContext with a NULL 'contextLoader'. Consider annotating your test class with @ContextConfiguration or @ContextHierarchy.
java.lang.IllegalStateException: Failed to load ApplicationContext
Caused by: java.lang.IllegalArgumentException: Cannot load an ApplicationContext with a NULL 'contextLoader'. Consider annotating your test class with @ContextConfiguration or @ContextHierarchy.
java.lang.IllegalStateException: Failed to load ApplicationContext
Caused by: java.lang.IllegalArgumentException: Cannot load an ApplicationContext with a NULL 'contextLoader'. Consider annotating your test class with @ContextConfiguration or @ContextHierarchy.
java.lang.IllegalStateException: Failed to load ApplicationContext
Caused by: java.lang.IllegalArgumentException: Cannot load an ApplicationContext with a NULL 'contextLoader'. Consider annotating your test class with @ContextConfiguration or @ContextHierarchy.
java.lang.IllegalStateException: Failed to load ApplicationContext
Caused by: java.lang.IllegalArgumentException: Cannot load an ApplicationContext with a NULL 'contextLoader'. Consider annotating your test class with @ContextConfiguration or @ContextHierarchy.
java.lang.IllegalStateException: Failed to load ApplicationContext
Caused by: java.lang.IllegalArgumentException: Cannot load an ApplicationContext with a NULL 'contextLoader'. Consider annotating your test class with @ContextConfiguration or @ContextHierarchy.
java.lang.AssertionError: 1 expectation failed.
Expected header "WWW-Authenticate" was not a string containing "Basic", was "null". Headers are:
Date=Sun, 10 Mar 2019 18:41:03 GMT
X-Frame-Options=SAMEORIGIN
Content-Length=0
Server=Jetty(9.4.14.v20181114)

java.lang.AssertionError: 
(8 more lines...)
Fixed tests 1
Status Test Failing since View job Duration
Successful OpsBoardAdminPageIT canCreateAndUseDeepLink History
Failing since build #103 (Changes by Bamboo Administrator) Smoke Test (Flapping) 29 secs
Skipped tests 46
Status Test Failing since View job
Skipped EchoRpcBlueprintIT org.opennms.core.rpc.aws.sqs.EchoRpcBlueprintIT History
Integration Test (Flapping)
Skipped EchoRpcIT org.opennms.core.rpc.aws.sqs.EchoRpcIT History
Integration Test (Flapping)
Skipped EchoRpcThreadIT org.opennms.core.rpc.aws.sqs.EchoRpcThreadIT History
Integration Test (Flapping)
Skipped InstallerDbIT testBug1574 History
Integration Test (Flapping)
Skipped InstallerDbIT testIfServicesNodeIdColumnConvertToNotNull History
Integration Test (Flapping)
Skipped InstallerDbIT testCatchIpInterfaceHasNullIpAddrValueOnUpgrade History
Integration Test (Flapping)
Skipped InstallerDbIT testIfServicesServiceIdColumnConvertToNotNull History
Integration Test (Flapping)
Skipped InstallerDbIT testOutagesServiceIdColumnConvertToNotNull History
Integration Test (Flapping)
Skipped InstallerDbIT testCatchSnmpInterfaceHasNullNodeIdValueOnUpgrade History
Integration Test (Flapping)
Skipped InstallerDbIT testSetOutageIdOnUpgrade History
Integration Test (Flapping)
Skipped InstallerDbIT testUpgradeColumnToNotNullWithDefault History
Integration Test (Flapping)
Skipped InstallerDbIT testIfServicesIpAddrColumnConvertToNotNull History
Integration Test (Flapping)
Skipped InstallerDbIT testIfServicesForeignKeyIpInterfaceIdOnUpgrade History
Integration Test (Flapping)
Skipped InstallerDbIT testCatchSnmpInterfaceNullNodeIdColumnOnUpgrade History
Integration Test (Flapping)
Skipped InstallerDbIT testSetSnmpInterfaceIdOnUpgrade History
Integration Test (Flapping)
Skipped InstallerDbIT testOutagesNodeIdColumnConvertToNotNull History
Integration Test (Flapping)
Skipped InstallerDbIT testSetUsersNotifiedIdOnUpgrade History
Integration Test (Flapping)
Skipped InstallerDbIT testSetEventSourceOnUpgrade History
Integration Test (Flapping)
Skipped InstallerDbIT testSomethingUnknown History
Integration Test (Flapping)
Skipped InstallerDbIT testIpInterfaceNodeIdColumnConvertToNotNull History
Integration Test (Flapping)
Skipped InstallerDbIT testUpgradeRevision3952ToCurrent History
Integration Test (Flapping)
Skipped InstallerDbIT testAssetsIdOnUpgrade History
Integration Test (Flapping)
Skipped InstallerDbIT testIpInterfaceForeignKeySnmpInterfaceIdOnUpgrade History
Integration Test (Flapping)
Skipped InstallerDbIT testSnmpInterfaceNodeIdColumnConvertToNotNull History
Integration Test (Flapping)
Skipped InstallerDbIT testCatchIpInterfaceNullIpAddrColumnOnUpgrade History
Integration Test (Flapping)
Skipped InstallerDbIT testOutagesForeignKeyIfServiceIdOnUpgrade History
Integration Test (Flapping)
Skipped InstallerDbIT testOutagesIfServiceIdColumnConvertToNotNull History
Integration Test (Flapping)
Skipped InstallerDbIT testSnmpInterfaceSnmpIfIndexColumnConvertToNotNull History
Integration Test (Flapping)
Skipped InstallerDbIT testUpgradeRevision3952ToCurrentWithData History
Integration Test (Flapping)
Skipped TemporaryDatabaseExecutionListenerNoClassAnnotationIT org.opennms.core.test.db.TemporaryDatabaseExecutionListenerNoClassAnnotationIT History
Integration Test (Flapping)
Skipped GenericURLStreamHandlerTest testFailToCreateURLStreamHandler History
Integration Test (Flapping)
Skipped NativeSocketTest org.opennms.jicmp.jna.NativeSocketTest History
Integration Test (Flapping)
Skipped PingThreadIT org.opennms.jicmp.standalone.PingThreadIT History
Integration Test (Flapping)
Skipped EventConfDataTest testV1EnterpriseIdAndGenericAndSpecificAndMatchWithVarbindsAndTC History
Integration Test (Flapping)
Skipped AlarmDaoIT testWithoutDistPoller History
Integration Test (Flapping)
Skipped AuthorizationIT testGetCategoriesWithAuthorizedGroups History
Integration Test (Flapping)
Skipped DefaultDataCollectionConfigDaoIT testLoadTimeOfDao History
Integration Test (Flapping)
Skipped JaxbUtilsTest testValidationMemoryLeak History
Integration Test (Flapping)
Skipped MonitoredServiceDaoIT testCriteriaBuilderWithApplicationAlias History
Integration Test (Flapping)
Skipped NodeDaoIT testCriteriaBuilderWithCategoryAlias History
Integration Test (Flapping)
Skipped JRobinRrdStrategyTest testSampleSetFloatingPointValueWithComma History
Integration Test (Flapping)
Skipped JRobinRrdStrategyTest testSampleSetFloatingPointValueWithExtraJunk History
Integration Test (Flapping)
Skipped IndexPageIT canSearchForNodeLabelInNodeId History
Smoke Test (Flapping)
Skipped JmxRemoteAdminIT org.opennms.smoketest.JmxRemoteAdminIT History
Smoke Test (Flapping)
Skipped MinionRestServiceIT verifyMinionRestEndPoint History
Smoke Test (Flapping)
Skipped ThresholdEditorIT org.opennms.smoketest.ThresholdEditorIT History
Smoke Test (Flapping)