Build #103

Build: #103 failed Changes by Bamboo Administrator

Build result summary

Details

Completed
Duration
480 minutes
Labels
None
Revisions
OpenNMS (develop branch)
11b1530c30e4d55250556f86d34c171bbdf67e41 11b1530c30e4d55250556f86d34c171bbdf67e41
OpenNMS Installer
da12784d9ab4ba4aacedec0283d0c04075fd6ebf da12784d9ab4ba4aacedec0283d0c04075fd6ebf
OpenNMS-Repo
088d710674109759251f42c6720d74ea80cf3f13 088d710674109759251f42c6720d74ea80cf3f13
Smoke Tests
cb1e72265cf2ce10cb4872f58120272b340a1ce1 cb1e72265cf2ce10cb4872f58120272b340a1ce1
OpenNMS Bamboo Utils
0a62053bc90f6ffcce1e17256674b2dae7b4f8a3 0a62053bc90f6ffcce1e17256674b2dae7b4f8a3
OpenNMS System Test API
bf421a0cca7d9068e45d2c6e42c4fddd4245b1fb bf421a0cca7d9068e45d2c6e42c4fddd4245b1fb
Total tests
2372
Failing since
#27 (Changes by mvrueden <mvrueden@users.noreply.github.com> and Jesse White)

Responsible

Code commits

OpenNMS (develop branch)
Author Commit Message Commit date
Bamboo Administrator Bamboo Administrator 11b1530c30e4d55250556f86d34c171bbdf67e41 11b1530c30e4d55250556f86d34c171bbdf67e41 [bamboo] Automated branch merge (from release-24.0.0:6e0400dcc959c27516c63c39e3a53f672353eb14)
Jesse White Jesse White 6e0400dcc959c27516c63c39e3a53f672353eb14 m 6e0400dcc959c27516c63c39e3a53f672353eb14 Merge pull request #2379 from OpenNMS/jira/NMS-10601
NMS-10601: Fix @PreserveOnRefresh for Vaadin UIs
Markus von Rüden Markus von Rüden e0941d89c4f1f65a3e505bb084975c872a801f33 m e0941d89c4f1f65a3e505bb084975c872a801f33 NMS-10601: Fix @PreserveOnRefresh for Vaadin UIs

Tests

New test failures 4
Status Test View job Duration
Collapse Failed SinkBlueprintMessageFailureIT org.opennms.core.ipc.sink.camel.itests.SinkBlueprintMessageFailureIT History
Integration Test (Flapping) 3 secs
java.lang.Exception: ActiveMQ broker was not started or stopped unexpectedly. Error: org.apache.activemq.broker.BrokerStoppedException: Stop invoked
	at org.opennms.core.test.activemq.ActiveMQBroker.before(ActiveMQBroker.java:56)
	at org.junit.rules.ExternalResource$1.evaluate(ExternalResource.java:46)
	at org.junit.rules.RunRules.evaluate(RunRules.java:20)
	at org.junit.runners.ParentRunner.run(ParentRunner.java:363)
	at org.springframework.test.context.junit4.SpringJUnit4ClassRunner.run(SpringJUnit4ClassRunner.java:193)
	at org.apache.maven.surefire.junit4.JUnit4Provider.execute(JUnit4Provider.java:275)
	at org.apache.maven.surefire.junit4.JUnit4Provider.executeWithRerun(JUnit4Provider.java:183)
(5 more lines...)
Collapse Failed SinkBlueprintMessageFailureIT doesntLogMessageBody History
Integration Test (Flapping) 3 secs
java.lang.AssertionError: null
	at org.junit.Assert.fail(Assert.java:86)
	at org.junit.Assert.assertTrue(Assert.java:41)
	at org.junit.Assert.assertNotNull(Assert.java:712)
	at org.junit.Assert.assertNotNull(Assert.java:722)
	at org.opennms.core.ipc.sink.camel.itests.SinkBlueprintMessageFailureIT.doesntLogMessageBody(SinkBlueprintMessageFailureIT.java:141)
Collapse Failed EditInRequisitionIT testIfDeployed History
Smoke Test (Flapping) 18 secs
org.junit.ComparisonFailure: expected:<Node [my-node-1 ]at SeleniumTestGroup> but was:<Node []at SeleniumTestGroup>
	at org.opennms.smoketest.EditInRequisitionIT.testIfDeployed(EditInRequisitionIT.java:84)
Collapse Failed OpsBoardAdminPageIT canCreateAndUseDeepLink History
Smoke Test (Flapping) 2 mins
org.openqa.selenium.TimeoutException: Timed out after 120 seconds waiting for org.opennms.smoketest.OpenNMSSeleniumTestCase$3@d88d9d7
Build info: version: '2.53.1', revision: 'a36b8b1cd5757287168e54b817830adce9b0158d', time: '2016-06-30 19:26:09'
System info: host: 'bambooagent04.internal.opennms.com', ip: '172.20.1.208', os.name: 'Linux', os.arch: 'amd64', os.version: '4.15.0-46-generic', java.version: '1.8.0_201'
Driver info: org.openqa.selenium.firefox.FirefoxDriver
Capabilities [{applicationCacheEnabled=true, rotatable=false, handlesAlerts=true, databaseEnabled=true, version=45.0.2, platform=LINUX, nativeEvents=false, acceptSslCerts=true, webStorageEnabled=true, locationContextEnabled=true, browserName=firefox, takesScreenshot=true, javascriptEnabled=true, cssSelectorsEnabled=true}]
Session ID: 44db01b8-5f09-4a85-a8c6-330fa1f8f358
org.openqa.selenium.TimeoutException: 
Timed out after 120 seconds waiting for org.opennms.smoketest.OpenNMSSeleniumTestCase$3@d88d9d7
(6 more lines...)
Existing test failures 20
Status Test Failing since View job Duration
java.lang.IllegalStateException: Failed to load ApplicationContext
Caused by: java.lang.IllegalArgumentException: Cannot load an ApplicationContext with a NULL 'contextLoader'. Consider annotating your test class with @ContextConfiguration or @ContextHierarchy.
java.lang.IllegalStateException: Failed to load ApplicationContext
Caused by: java.lang.IllegalArgumentException: Cannot load an ApplicationContext with a NULL 'contextLoader'. Consider annotating your test class with @ContextConfiguration or @ContextHierarchy.
java.lang.IllegalStateException: Failed to load ApplicationContext
Caused by: java.lang.IllegalArgumentException: Cannot load an ApplicationContext with a NULL 'contextLoader'. Consider annotating your test class with @ContextConfiguration or @ContextHierarchy.
java.lang.IllegalStateException: Failed to load ApplicationContext
Caused by: java.lang.IllegalArgumentException: Cannot load an ApplicationContext with a NULL 'contextLoader'. Consider annotating your test class with @ContextConfiguration or @ContextHierarchy.
java.lang.IllegalStateException: Failed to load ApplicationContext
Caused by: java.lang.IllegalArgumentException: Cannot load an ApplicationContext with a NULL 'contextLoader'. Consider annotating your test class with @ContextConfiguration or @ContextHierarchy.
java.lang.IllegalStateException: Failed to load ApplicationContext
Caused by: java.lang.IllegalArgumentException: Cannot load an ApplicationContext with a NULL 'contextLoader'. Consider annotating your test class with @ContextConfiguration or @ContextHierarchy.
java.lang.IllegalStateException: Failed to load ApplicationContext
Caused by: java.lang.IllegalArgumentException: Cannot load an ApplicationContext with a NULL 'contextLoader'. Consider annotating your test class with @ContextConfiguration or @ContextHierarchy.
java.lang.IllegalStateException: Failed to load ApplicationContext
Caused by: java.lang.IllegalArgumentException: Cannot load an ApplicationContext with a NULL 'contextLoader'. Consider annotating your test class with @ContextConfiguration or @ContextHierarchy.
java.lang.IllegalStateException: Failed to load ApplicationContext
Caused by: java.lang.IllegalArgumentException: Cannot load an ApplicationContext with a NULL 'contextLoader'. Consider annotating your test class with @ContextConfiguration or @ContextHierarchy.
java.lang.IllegalStateException: Failed to load ApplicationContext
Caused by: java.lang.IllegalArgumentException: Cannot load an ApplicationContext with a NULL 'contextLoader'. Consider annotating your test class with @ContextConfiguration or @ContextHierarchy.
java.lang.IllegalStateException: Failed to load ApplicationContext
Caused by: java.lang.IllegalArgumentException: Cannot load an ApplicationContext with a NULL 'contextLoader'. Consider annotating your test class with @ContextConfiguration or @ContextHierarchy.
java.lang.IllegalStateException: Failed to load ApplicationContext
Caused by: java.lang.IllegalArgumentException: Cannot load an ApplicationContext with a NULL 'contextLoader'. Consider annotating your test class with @ContextConfiguration or @ContextHierarchy.
java.lang.IllegalStateException: Failed to load ApplicationContext
Caused by: java.lang.IllegalArgumentException: Cannot load an ApplicationContext with a NULL 'contextLoader'. Consider annotating your test class with @ContextConfiguration or @ContextHierarchy.
java.lang.IllegalStateException: Failed to load ApplicationContext
Caused by: java.lang.IllegalArgumentException: Cannot load an ApplicationContext with a NULL 'contextLoader'. Consider annotating your test class with @ContextConfiguration or @ContextHierarchy.
java.lang.IllegalStateException: Failed to load ApplicationContext
Caused by: java.lang.IllegalArgumentException: Cannot load an ApplicationContext with a NULL 'contextLoader'. Consider annotating your test class with @ContextConfiguration or @ContextHierarchy.
java.lang.IllegalStateException: Failed to load ApplicationContext
Caused by: java.lang.IllegalArgumentException: Cannot load an ApplicationContext with a NULL 'contextLoader'. Consider annotating your test class with @ContextConfiguration or @ContextHierarchy.
java.lang.IllegalStateException: Failed to load ApplicationContext
Caused by: java.lang.IllegalArgumentException: Cannot load an ApplicationContext with a NULL 'contextLoader'. Consider annotating your test class with @ContextConfiguration or @ContextHierarchy.
java.lang.IllegalStateException: Failed to load ApplicationContext
Caused by: java.lang.IllegalArgumentException: Cannot load an ApplicationContext with a NULL 'contextLoader'. Consider annotating your test class with @ContextConfiguration or @ContextHierarchy.
java.lang.IllegalStateException: Failed to load ApplicationContext
Caused by: java.lang.IllegalArgumentException: Cannot load an ApplicationContext with a NULL 'contextLoader'. Consider annotating your test class with @ContextConfiguration or @ContextHierarchy.
java.lang.IllegalStateException: Failed to load ApplicationContext
Caused by: java.lang.IllegalArgumentException: Cannot load an ApplicationContext with a NULL 'contextLoader'. Consider annotating your test class with @ContextConfiguration or @ContextHierarchy.
Fixed tests 1
Status Test Failing since View job Duration
Successful TopologyIT verifyNoVerticesFoundTextIsShown History
Failing since build #101 (Changes by Bamboo Administrator) Smoke Test (Flapping) 49 secs

Jira issues

IssueDescriptionStatus
Unknown Issue TypeNMS-10601Could not obtain issue details from Jira